{"text_format":"1","workbook":"xlsx","n_sheets":5,"sheets":["(1)Front Sheet","(2)SupportAssessMatrix","(3)Ranked List of DAs","(4)Assessment Rationale"," (5) NeSTS Assessment"],"not_rendered":{"charts":0,"images":14,"macros":1,"external_links":1,"defined_names":46,"comments":2,"pivot_tables":0},"unopened":[],"bounds":{"document_bytes":16777216,"sheet_cells":100000,"rows_first":2000,"rows_last":500,"rows_between":2000,"halvings":0,"cell_chars":16384,"cell_head_chars":4096},"cells_cut":0,"cells_raw":0,"read":"whole","date_system":"1900"}

{"sheet":"(1)Front Sheet","index":0,"n_rows":46,"n_cols":1,"rows_kept":46,"cut":false,"hidden":false,"merged":[[31,0,43,9],[44,0,44,1],[45,0,52,9],[22,0,22,4],[22,5,22,9],[20,0,20,4],[20,5,20,9],[21,0,21,4],[21,5,21,9],[18,0,18,9],[19,0,19,9],[7,0,7,9],[0,0,0,9],[1,0,1,9],[2,0,2,9],[4,0,4,9],[14,0,14,9],[15,0,15,9],[16,0,16,9],[17,0,17,9],[9,0,9,9],[10,0,10,9],[11,0,11,9],[12,0,12,9],[13,0,13,9]]}
[]
["Energyline Limited, York House, 9 York Place, Knaresborough, HG5 0AD: 01423799950"]
[]
[]
["Client"]
[]
[]
[]
[]
[]
["Project Description"]
["SSEN003 NeSTS"]
[]
[]
[]
["Document Title"]
["Support Assessment Matrix"]
["for Outline General Arrangements"]
[]
[]
["Protection Password"]
["686"]
[]
[]
[]
[]
["ConductorConfiguration"]
["Vertical"]
["Tri-form"]
["Horizontal"]
[]
["While this document has been prepared in good faith, no representation, warranty, assurance or undertaking (express or implied) is or will be made, and no responsibility or liability is or will be accepted by Scottish Hydro Electric Transmission PLC or any of its group companies or by any of their respective officers, employees or agents (“the SHE-T Parties”) in relation to the adequacy, accuracy, completeness or reasonableness of the information contained in this document. In particular, but without prejudice to the generality of the foregoing, no representation, warranty, assurance or undertaking is given as to the suitability of the designs referred to in this document for any purpose and/or for any user. Relevant legal and regulatory requirements are out with the scope of this document. Each Transmission Owner and Distribution Network Operator has different requirements for their equipment and any user must satisfy itself that the principals outlined within this document are suitable to the Transmission Owner or Distribution Network Operator's requirements and compliant with all  relevant legal and regulatory requirements which may be in force from time to time.  The SHE-T Parties shall not be liable to any third party which relies on any information contained in this document. "]
[]
[]
[]
[]
[]
[]
[]
[]
[]
[]
[]
[]
[]
["Scottish and Southern Electricity Networks is a trading name of: Scottish and Southern Energy Power Distribution Limited Registered in Scotland No. SC213459; Scottish Hydro Electric Transmission plc Registered in Scotland No. SC213461; Scottish Hydro Electric Power Distribution plc Registered in Scotland No. SC213460; (all having their Registered Offices at Inveralmond House 200 Dunkeld Road Perth PH1 3AQ); and Southern Electric Power Distribution plc Registered in England & Wales No. 04094290 having its Registered Office at 55 Vastern Road Reading Berkshire RG1 8BU which are members of the SSE Group. \nwww.ssen.co.uk\n"]

{"sheet":"(2)SupportAssessMatrix","index":1,"n_rows":185,"n_cols":48,"rows_kept":185,"cut":false,"hidden":false,"merged":[[22,19,22,20],[35,19,35,20],[51,19,51,20],[61,19,61,20],[79,19,79,20],[22,34,22,35],[22,37,22,38],[22,40,22,41],[35,0,35,2],[35,13,35,14],[35,16,35,17],[35,22,35,23],[35,25,35,26],[35,28,35,29],[35,31,35,32],[22,13,22,14],[22,16,22,17],[22,22,22,23],[22,25,22,26],[22,28,22,29],[22,31,22,32],[35,34,35,35],[35,37,35,38],[35,40,35,41],[51,0,51,2],[51,13,51,14],[51,16,51,17],[51,22,51,23],[51,25,51,26],[51,28,51,29],[51,31,51,32],[51,34,51,35],[51,37,51,38],[51,40,51,41],[61,0,61,2],[61,13,61,14],[61,16,61,17],[61,22,61,23],[61,25,61,26],[61,28,61,29],[61,31,61,32],[61,34,61,35],[61,37,61,38],[61,40,61,41],[79,0,79,2],[79,13,79,14],[79,16,79,17],[79,22,79,23],[79,25,79,26],[79,28,79,29],[79,31,79,32],[79,34,79,35],[79,37,79,38],[79,40,79,41],[89,0,89,2],[89,13,89,14],[89,16,89,17],[89,22,89,23],[89,25,89,26],[89,19,89,20],[89,28,89,29],[89,31,89,32],[89,34,89,35],[89,37,89,38],[89,40,89,41],[94,0,94,2],[94,13,94,14],[94,16,94,17],[94,22,94,23],[94,25,94,26],[94,19,94,20],[107,0,107,2],[107,13,107,14],[107,16,107,17],[107,22,107,23],[107,25,107,26],[107,19,107,20],[114,28,114,29],[114,31,114,32],[94,34,94,35],[94,37,94,38],[94,40,94,41],[107,28,107,29],[107,31,107,32],[114,34,114,35],[114,37,114,38],[114,40,114,41],[107,34,107,35],[107,37,107,38],[107,40,107,41],[94,28,94,29],[94,31,94,32],[114,0,114,2],[114,13,114,14],[114,16,114,17],[114,22,114,23],[114,25,114,26],[114,19,114,20]]}
["MDA Weightings",null,null,null,null,null,null,null,null,null,null,null,null,"L8RD M4.9",null,null,"Support 1",null,null,"Support 2",null,null,"Support 3",null,null,"Support 4",null,null,"Support 5",null,null,"Support 6",null,null,"Support 7",null,null,"Support 8",null,null,"Support 9"]
[]
[{"$f":"A26","v":"Electrical"},null,13,null,{"$f":"C3/(C17+C15+C11+C9+C7+C5+C3+C13)","v":0.13}]
[]
[{"$f":"A37","v":"Supports & Foundations"},null,13,null,{"$f":"C5/(C17+C15+C11+C9+C7+C5+C3+C13)","v":0.13},null,null,null,"Support Type",null,null,null,null,"L8RD M4.9",null,null,"XXX",null,null,"XXX",null,null,"XXX",null,null,"XXX",null,null,"XXX",null,null,"XXX",null,null,"XXX",null,null,"XXX",null,null,"XXX"]
[]
[{"$f":"A53","v":"Mechanical & Electrical"},null,13,null,{"$f":"C7/(C17+C15+C11+C9+C7+C5+C3+C13)","v":0.13}]
[null,null,null,null,null,null,null,null,"Conductor configuration",null,null,null,null,"Vertical",null,null,"Vertical",null,null,"Vertical",null,null,"Vertical",null,null,"Vertical",null,null,"Vertical",null,null,"Vertical",null,null,"Vertical",null,null,"Vertical",null,null,"Vertical"]
[{"$f":"A63","v":"Construction "},null,13,null,{"$f":"C9/(C17+C15+C11+C9+C7+C5+C3+C13)","v":0.13},null,null,null,"Nominal standard span (m)",null,null,null,null,305,null,null,0,null,null,0,null,null,0,null,null,0,null,null,0,null,null,0,null,null,0,null,null,0,null,null,0]
[]
[{"$f":"A81","v":"Maintenance"},null,12,null,{"$f":"C11/(C17+C15+C11+C9+C7+C5+C3+C13)","v":0.12}]
[]
[{"$f":"A91","v":"Operational Safety"},null,12,null,{"$f":"C13/(C3+C17+C13+C11+C9+C7+C5+C15)","v":0.12}]
[]
[{"$f":"A96","v":"Environmental"},null,12,null,{"$f":"C15/(C17+C15+C11+C9+C7+C5+C3+C13)","v":0.12}]
[]
[{"$f":"A109","v":"Other"},null,12,null,{"$f":"C17/(C17+C15+C11+C9+C7+C13+C5+C3)","v":0.12}]
[]
["[Adjust total MDA weightings to 100]",null,{"$f":"C3+C5+C7+C9+C11+C15+C17+C13","v":100},null,null,null,null,null,null,null,null,null,null,{"$f":"N1","v":"L8RD M4.9"},null,null,{"$f":"Q1","v":"Support 1"},null,null,{"$f":"T1","v":"Support 2"},null,null,{"$f":"W1","v":"Support 3"},null,null,{"$f":"Z1","v":"Support 4"},null,null,{"$f":"AC1","v":"Support 5"},null,null,{"$f":"AF1","v":"Support 6"},null,null,{"$f":"AI1","v":"Support 7"},null,null,{"$f":"AL1","v":"Support 8"},null,null,{"$f":"AO1","v":"Support 9"}]
[null,null,null,null,null,null,null,null,null,null,null,null,null,"(BENCHMARK)"]
[]
[]
[null,null,"Totals",null,null,null,null,null,null,null,null,{"$f":"L36+L52+L62+L80+L90+L108+L115+L95","v":1},null,{"$f":"(N36+N52+N62+N80+N90+N95+N108+N115)*10","v":0},null,null,{"$f":"(Q36+Q52+Q62+Q80+Q90+Q95+Q108+Q115)*10","v":0},null,null,{"$f":"(T36+T52+T62+T80+T90+T95+T108+T115)*10","v":0},null,null,{"$f":"(W36+W52+W62+W80+W90+W95+W108+W115)*10","v":0},null,null,{"$f":"(Z36+Z52+Z62+Z80+Z90+Z95+Z108+Z115)*10","v":0},null,null,{"$f":"(AC36+AC52+AC62+AC80+AC90+AC95+AC108+AC115)*10","v":0},null,null,{"$f":"(AF36+AF52+AF62+AF80+AF90+AF95+AF108+AF115)*10","v":0},null,null,{"$f":"(AI36+AI52+AI62+AI80+AI90+AI95+AI108+AI115)*10","v":0},null,null,{"$f":"(AL36+AL52+AL62+AL80+AL90+AL95+AL108+AL115)*10","v":0},null,null,{"$f":"(AO36+AO52+AO62+AO80+AO90+AO95+AO108+AO115)*10","v":0}]
[]
["Main Design Aspect (MDA)","Ref","Design Aspect (DA)","Status (Prov/ comp)","Quant/ Qual",null,"MDA weighting (from top left)",null,"Sub DA adjust't","Sub DA weighting",null,"Overall weighting (%)",null,"Score","Weighted score",null,"Score","Weighted score",null,"Score","Weighted score",null,"Score","Weighted score",null,"Score","Weighted score",null,"Score","Weighted score",null,"Score","Weighted score",null,"Score","Weighted score",null,"Score","Weighted score",null,"Score","Weighted score"]
["Electrical","E.1","Audible Noise","Complete","Quant've",null,{"$f":"$E$3","v":0.13},null,1,{"$f":"I26/$I$36","v":0.1},null,{"$f":"G26*J26","v":1.3000000000000001E-2},null,0,{"$f":"N26*$L26","v":0},null,0,{"$f":"Q26*$L26","v":0},null,0,{"$f":"T26*$L26","v":0},null,0,{"$f":"W26*$L26","v":0},null,0,{"$f":"Z26*$L26","v":0},null,0,{"$f":"AC26*$L26","v":0},null,0,{"$f":"AF26*$L26","v":0},null,0,{"$f":"AI26*$L26","v":0},null,0,{"$f":"AL26*$L26","v":0},null,0,{"$f":"AO26*$L26","v":0},null,{"$f":"MIN(N26,Q26,W26,Z26,AC26,AF26,AI26,AL26,AO26)","v":0},{"$f":"MAX(N26,Q26,W26,Z26,AC26,AF26,AI26,AL26,AO26)","v":0},{"$f":"IF(AND(AR26=1,AS26=9),\"\",\"check\")","v":"check"}]
["Electrical","E.2","Magnetic Fields (external)","Complete","Quant've",null,0.13,null,1,{"$f":"I27/$I$36","v":0.1},null,{"$f":"G27*J27","v":1.3000000000000001E-2},null,0,{"$f":"N27*$L27","v":0},null,0,0,null,0,0,null,0,0,null,0,0,null,0,0,null,0,0,null,0,0,null,0,0,null,0,0,null,{"$f":"MIN(N27,Q27,W27,Z27,AC27,AF27,AI27,AL27,AO27)","v":0},{"$f":"MAX(N27,Q27,W27,Z27,AC27,AF27,AI27,AL27,AO27)","v":0},{"$f":"IF(AND(AR27=1,AS27=9),\"\",\"check\")","v":"check"}]
["Electrical","E.3","Electric Fields (external)","Complete","Quant've",null,0.13,null,1,0.1,null,1.3000000000000001E-2,null,0,0,null,0,0,null,0,0,null,0,0,null,0,0,null,0,0,null,0,0,null,0,0,null,0,0,null,0,0,null,0,0,"check"]
["Electrical","E.4","Radio Interference","Complete","Quant've",null,0.13,null,1,0.1,null,1.3000000000000001E-2,null,0,0,null,0,0,null,0,0,null,0,0,null,0,0,null,0,0,null,0,0,null,0,0,null,0,0,null,0,0,null,0,0,"check"]
["Electrical","E.5","Earthing Performance","Complete","Qual",null,0.13,null,1,0.1,null,1.3000000000000001E-2,null,0,0,null,0,0,null,0,0,null,0,0,null,0,0,null,0,0,null,0,0,null,0,0,null,0,0,null,0,0,null,0,0,"check"]
["Electrical","E.6","Lightning Performance","Complete","Quant've",null,0.13,null,1,0.1,null,1.3000000000000001E-2,null,0,0,null,0,0,null,0,0,null,0,0,null,0,0,null,0,0,null,0,0,null,0,0,null,0,0,null,0,0,null,0,0,"check"]
["Electrical","E.7","Insulation Coordination","Complete","Quant've",null,0.13,null,1,0.1,null,1.3000000000000001E-2,null,0,0,null,0,0,null,0,0,null,0,0,null,0,0,null,0,0,null,0,0,null,0,0,null,0,0,null,0,0,null,0,0,"check"]
["Electrical","E.8","Surge Impedance Loading (SIL) ","Complete","Quant've",null,0.13,null,1,0.1,null,1.3000000000000001E-2,null,0,0,null,0,0,null,0,0,null,0,0,null,0,0,null,0,0,null,0,0,null,0,0,null,0,0,null,0,0,null,0,0,"check"]
["Electrical","E.9","Electric Fields within/near structure","Complete","Quant've",null,0.13,null,1,0.1,null,1.3000000000000001E-2,null,0,0,null,0,0,null,0,0,null,0,0,null,0,0,null,0,0,null,0,0,null,0,0,null,0,0,null,0,0,null,0,0,"check"]
["Electrical","E.10","Magnetic Fields within/ near structure","Complete","Quant've",null,0.13,null,1,0.1,null,1.3000000000000001E-2,null,0,0,null,0,0,null,0,0,null,0,0,null,0,0,null,0,0,null,0,0,null,0,0,null,0,0,null,0,0,null,0,0,"check"]
["Electrical Totals",null,null,null,null,null,null,null,{"$f":"SUM(I26:I35)","v":10},{"$f":"SUM(J26:J35)","v":0.99999999999999989},null,{"$f":"SUM(L26:L35)","v":0.13},null,{"$f":"SUM(O26:O35)","v":0},null,null,{"$f":"SUM(R26:R35)","v":0},null,null,{"$f":"SUM(U26:U35)","v":0},null,null,{"$f":"SUM(X26:X35)","v":0},null,null,{"$f":"SUM(AA26:AA35)","v":0},null,null,{"$f":"SUM(AD26:AD35)","v":0},null,null,{"$f":"SUM(AG26:AG35)","v":0},null,null,{"$f":"SUM(AJ26:AJ35)","v":0},null,null,{"$f":"SUM(AM26:AM35)","v":0},null,null,{"$f":"SUM(AP26:AP35)","v":0}]
["Supports & Foundations","S.1","Number of elements","Complete","Quant've",null,{"$f":"$E$5","v":0.13},null,1,{"$f":"I37/$I$52","v":6.6666666666666666E-2},null,{"$f":"G37*J37","v":8.6666666666666663E-3},null,0,{"$f":"N37*$L37","v":0},null,0,{"$f":"Q37*$L37","v":0},null,0,{"$f":"T37*$L37","v":0},null,0,{"$f":"W37*$L37","v":0},null,0,{"$f":"Z37*$L37","v":0},null,0,{"$f":"AC37*$L37","v":0},null,0,{"$f":"AF37*$L37","v":0},null,0,{"$f":"AI37*$L37","v":0},null,0,{"$f":"AL37*$L37","v":0},null,0,{"$f":"AO37*$L37","v":0},null,0,0,"check"]
["Supports & Foundations","S.2","Number of joints","Complete","Quant've",null,0.13,null,1,6.6666666666666666E-2,null,{"$f":"G38*J38","v":8.6666666666666663E-3},null,0,{"$f":"N38*$L38","v":0},null,0,{"$f":"Q38*$L38","v":0},null,0,{"$f":"T38*$L38","v":0},null,0,{"$f":"W38*$L38","v":0},null,0,{"$f":"Z38*$L38","v":0},null,0,{"$f":"AC38*$L38","v":0},null,0,{"$f":"AF38*$L38","v":0},null,0,{"$f":"AI38*$L38","v":0},null,0,{"$f":"AL38*$L38","v":0},null,0,{"$f":"AO38*$L38","v":0},null,0,0,"check"]
["Supports & Foundations","S.3","Side slope added complexity","Complete","Quant've",null,0.13,null,1,6.6666666666666666E-2,null,{"$f":"G39*J39","v":8.6666666666666663E-3},null,0,{"$f":"N39*$L39","v":0},null,0,{"$f":"Q39*$L39","v":0},null,0,{"$f":"T39*$L39","v":0},null,0,{"$f":"W39*$L39","v":0},null,0,{"$f":"Z39*$L39","v":0},null,0,{"$f":"AC39*$L39","v":0},null,0,{"$f":"AF39*$L39","v":0},null,0,{"$f":"AI39*$L39","v":0},null,0,{"$f":"AL39*$L39","v":0},null,0,{"$f":"AO39*$L39","v":0},null,0,0,"check"]
["Supports & Foundations","S.4","Weight of structure (per km)","Complete","Quant've",null,0.13,null,1,6.6666666666666666E-2,null,{"$f":"G40*J40","v":8.6666666666666663E-3},null,0,{"$f":"N40*$L40","v":0},null,0,{"$f":"Q40*$L40","v":0},null,0,{"$f":"T40*$L40","v":0},null,0,{"$f":"W40*$L40","v":0},null,0,{"$f":"Z40*$L40","v":0},null,0,{"$f":"AC40*$L40","v":0},null,0,{"$f":"AF40*$L40","v":0},null,0,{"$f":"AI40*$L40","v":0},null,0,{"$f":"AL40*$L40","v":0},null,0,{"$f":"AO40*$L40","v":0},null,0,0,"check"]
["Supports & Foundations","S.5","Suitability to use of alternative materials","Complete","Qual",null,0.13,null,1,6.6666666666666666E-2,null,8.6666666666666663E-3,null,0,0,null,0,0,null,0,0,null,0,0,null,0,0,null,0,0,null,0,0,null,0,0,null,0,0,null,0,0,null,0,0,"check"]
["Supports & Foundations","S.6","Reduction in reliability in single circuit configuration (i.e. strung one side)","Complete","Quant've",null,0.13,null,1,6.6666666666666666E-2,null,8.6666666666666663E-3,null,0,0,null,0,0,null,0,0,null,0,0,null,0,0,null,0,0,null,0,0,null,0,0,null,0,0,null,0,0,null,0,0,"check"]
["Supports & Foundations","S.7","Ice accretion performance","Complete","Quant've",null,0.13,null,1,6.6666666666666666E-2,null,8.6666666666666663E-3,null,0,0,null,0,0,null,0,0,null,0,0,null,0,0,null,0,0,null,0,0,null,0,0,null,0,0,null,0,0,null,0,0,"check"]
["Supports & Foundations","S.8","Area for painting","Complete","Quant've",null,0.13,null,1,6.6666666666666666E-2,null,8.6666666666666663E-3,null,0,0,null,0,0,null,0,0,null,0,0,null,0,0,null,0,0,null,0,0,null,0,0,null,0,0,null,0,0,null,0,0,"check"]
["Supports & Foundations","S.9","Implications of addition of extensions","Complete","Quant've",null,0.13,null,1,6.6666666666666666E-2,null,8.6666666666666663E-3,null,0,0,null,0,0,null,0,0,null,0,0,null,0,0,null,0,0,null,0,0,null,0,0,null,0,0,null,0,0,null,0,0,"check"]
["Supports & Foundations","S.10","Length of load path","Complete","Quant've",null,0.13,null,1,6.6666666666666666E-2,null,8.6666666666666663E-3,null,0,0,null,0,0,null,0,0,null,0,0,null,0,0,null,0,0,null,0,0,null,0,0,null,0,0,null,0,0,null,0,0,"check"]
["Supports & Foundations","S.11","Familiarity with Form (familiar forms score high)","Complete","Qual",null,0.13,null,1,6.6666666666666666E-2,null,{"$f":"G47*J47","v":8.6666666666666663E-3},null,0,{"$f":"N47*$L47","v":0},null,0,{"$f":"Q47*$L47","v":0},null,0,{"$f":"T47*$L47","v":0},null,0,{"$f":"W47*$L47","v":0},null,0,{"$f":"Z47*$L47","v":0},null,0,{"$f":"AC47*$L47","v":0},null,0,{"$f":"AF47*$L47","v":0},null,0,{"$f":"AI47*$L47","v":0},null,0,{"$f":"AL47*$L47","v":0},null,0,{"$f":"AO47*$L47","v":0},null,0,0,"check"]
["Supports & Foundations","S.12","Foundation complexity","Complete","Qual",null,0.13,null,1,6.6666666666666666E-2,null,{"$f":"G48*J48","v":8.6666666666666663E-3},null,0,{"$f":"N48*$L48","v":0},null,0,{"$f":"Q48*$L48","v":0},null,0,{"$f":"T48*$L48","v":0},null,0,{"$f":"W48*$L48","v":0},null,0,{"$f":"Z48*$L48","v":0},null,0,{"$f":"AC48*$L48","v":0},null,0,{"$f":"AF48*$L48","v":0},null,0,{"$f":"AI48*$L48","v":0},null,0,{"$f":"AL48*$L48","v":0},null,0,{"$f":"AO48*$L48","v":0},null,0,0,"check"]
["Supports & Foundations","S.13","Foundations (Volume of concrete per km)","Complete","Quant've",null,0.13,null,1,6.6666666666666666E-2,null,{"$f":"G49*J49","v":8.6666666666666663E-3},null,0,{"$f":"N49*$L49","v":0},null,0,{"$f":"Q49*$L49","v":0},null,0,{"$f":"T49*$L49","v":0},null,0,{"$f":"W49*$L49","v":0},null,0,{"$f":"Z49*$L49","v":0},null,0,{"$f":"AC49*$L49","v":0},null,0,{"$f":"AF49*$L49","v":0},null,0,{"$f":"AI49*$L49","v":0},null,0,{"$f":"AL49*$L49","v":0},null,0,{"$f":"AO49*$L49","v":0},null,0,0,"check"]
["Supports & Foundations","S.14","Foundations (Volume of excavation per km)","Complete","Quant've",null,0.13,null,1,6.6666666666666666E-2,null,{"$f":"G50*J50","v":8.6666666666666663E-3},null,0,{"$f":"N50*$L50","v":0},null,0,{"$f":"Q50*$L50","v":0},null,0,{"$f":"T50*$L50","v":0},null,0,{"$f":"W50*$L50","v":0},null,0,{"$f":"Z50*$L50","v":0},null,0,{"$f":"AC50*$L50","v":0},null,0,{"$f":"AF50*$L50","v":0},null,0,{"$f":"AI50*$L50","v":0},null,0,{"$f":"AL50*$L50","v":0},null,0,{"$f":"AO50*$L50","v":0},null,0,0,"check"]
["Supports & Foundations","S.15","Suitability for application of two earthwires","Complete","Qual",null,0.13,null,1,{"$f":"I51/$I$52","v":6.6666666666666666E-2},null,{"$f":"G51*J51","v":8.6666666666666663E-3},null,0,{"$f":"N51*$L51","v":0},null,0,{"$f":"Q51*$L51","v":0},null,0,{"$f":"T51*$L51","v":0},null,0,{"$f":"W51*$L51","v":0},null,0,{"$f":"Z51*$L51","v":0},null,0,{"$f":"AC51*$L51","v":0},null,0,{"$f":"AF51*$L51","v":0},null,0,{"$f":"AI51*$L51","v":0},null,0,{"$f":"AL51*$L51","v":0},null,0,{"$f":"AO51*$L51","v":0},null,0,0,"check"]
["Supports & Foundations Totals",null,null,null,null,null,null,null,{"$f":"SUM(I37:I51)","v":15},{"$f":"SUM(J37:J51)","v":0.99999999999999989},null,{"$f":"SUM(L37:L51)","v":0.13000000000000003},null,{"$f":"SUM(O37:O51)","v":0},null,null,{"$f":"SUM(R37:R51)","v":0},null,null,{"$f":"SUM(U37:U51)","v":0},null,null,{"$f":"SUM(X37:X51)","v":0},null,null,{"$f":"SUM(AA37:AA51)","v":0},null,null,{"$f":"SUM(AD37:AD51)","v":0},null,null,{"$f":"SUM(AG37:AG51)","v":0},null,null,{"$f":"SUM(AJ37:AJ51)","v":0},null,null,{"$f":"SUM(AM37:AM51)","v":0},null,null,{"$f":"SUM(AP37:AP51)","v":0}]
["Mechanical & Electrical","M.1","Insulation Mechanical Reliability","Complete","Qual",null,{"$f":"$E$7","v":0.13},null,1,{"$f":"I53/$I$62","v":0.1111111111111111},null,{"$f":"G53*J53","v":1.4444444444444444E-2},null,0,{"$f":"N53*$L53","v":0},null,0,{"$f":"Q53*$L53","v":0},null,0,{"$f":"T53*$L53","v":0},null,0,{"$f":"W53*$L53","v":0},null,0,{"$f":"Z53*$L53","v":0},null,0,{"$f":"AC53*$L53","v":0},null,0,{"$f":"AF53*$L53","v":0},null,0,{"$f":"AI53*$L53","v":0},null,0,{"$f":"AL53*$L53","v":0},null,0,{"$f":"AO53*$L53","v":0},null,0,0,"check"]
["Mechanical & Electrical","M.2","Insulation Material Limitation","Complete","Qual",null,0.13,null,1,{"$f":"I54/$I$62","v":0.1111111111111111},null,1.4444444444444444E-2,null,0,0,null,0,{"$f":"Q54*$L54","v":0},null,0,{"$f":"T54*$L54","v":0},null,0,{"$f":"W54*$L54","v":0},null,0,{"$f":"Z54*$L54","v":0},null,0,{"$f":"AC54*$L54","v":0},null,0,{"$f":"AF54*$L54","v":0},null,0,{"$f":"AI54*$L54","v":0},null,0,{"$f":"AL54*$L54","v":0},null,0,{"$f":"AO54*$L54","v":0},null,0,0,"check"]
["Mechanical & Electrical","M.3","Number of Insulators","Complete","Qual",null,0.13,null,1,0.1111111111111111,null,1.4444444444444444E-2,null,0,0,null,0,{"$f":"Q55*$L55","v":0},null,0,{"$f":"T55*$L55","v":0},null,0,{"$f":"W55*$L55","v":0},null,0,{"$f":"Z55*$L55","v":0},null,0,{"$f":"AC55*$L55","v":0},null,0,{"$f":"AF55*$L55","v":0},null,0,{"$f":"AI55*$L55","v":0},null,0,{"$f":"AL55*$L55","v":0},null,0,{"$f":"AO55*$L55","v":0},null,0,0,"check"]
["Mechanical & Electrical","M.4","Galloping (susceptibility to conductor clashing)","Complete","Qual",null,0.13,null,1,{"$f":"I56/$I$62","v":0.1111111111111111},null,1.4444444444444444E-2,null,0,0,null,0,{"$f":"Q56*$L56","v":0},null,0,{"$f":"T56*$L56","v":0},null,0,{"$f":"W56*$L56","v":0},null,0,{"$f":"Z56*$L56","v":0},null,0,{"$f":"AC56*$L56","v":0},null,0,{"$f":"AF56*$L56","v":0},null,0,{"$f":"AI56*$L56","v":0},null,0,{"$f":"AL56*$L56","v":0},null,0,{"$f":"AO56*$L56","v":0},null,0,0,"check"]
["Mechanical & Electrical","M.5","Formation of Jumpers at Angle Supports","Complete","Qual",null,0.13,null,1,{"$f":"I57/$I$62","v":0.1111111111111111},null,1.4444444444444444E-2,null,0,0,null,0,0,null,0,0,null,0,0,null,0,0,null,0,0,null,0,0,null,0,0,null,0,0,null,0,0,null,0,0,"check"]
["Mechanical & Electrical","M.6","Angle Support Insulation","Complete","Qual",null,0.13,null,1,{"$f":"I58/$I$62","v":0.1111111111111111},null,1.4444444444444444E-2,null,0,0,null,0,0,null,0,0,null,0,0,null,0,0,null,0,0,null,0,0,null,0,0,null,0,0,null,0,0,null,0,0,"check"]
["Mechanical & Electrical","M.7","Type Testing Requirements","Complete","Qual",null,0.13,null,1,{"$f":"I59/$I$62","v":0.1111111111111111},null,1.4444444444444444E-2,null,0,0,null,0,{"$f":"Q59*$L59","v":0},null,0,{"$f":"T59*$L59","v":0},null,0,{"$f":"W59*$L59","v":0},null,0,{"$f":"Z59*$L59","v":0},null,0,{"$f":"AC59*$L59","v":0},null,0,{"$f":"AF59*$L59","v":0},null,0,{"$f":"AI59*$L59","v":0},null,0,{"$f":"AL59*$L59","v":0},null,0,{"$f":"AO59*$L59","v":0},null,0,0,"check"]
["Mechanical & Electrical","M.8","Suitability for ICA adaption","Complete","Qual",null,0.13,null,1,{"$f":"I60/$I$62","v":0.1111111111111111},null,1.4444444444444444E-2,null,0,0,null,0,{"$f":"Q60*$L60","v":0},null,0,{"$f":"T60*$L60","v":0},null,0,{"$f":"W60*$L60","v":0},null,0,{"$f":"Z60*$L60","v":0},null,0,{"$f":"AC60*$L60","v":0},null,0,{"$f":"AF60*$L60","v":0},null,0,{"$f":"AI60*$L60","v":0},null,0,{"$f":"AL60*$L60","v":0},null,0,{"$f":"AO60*$L60","v":0},null,0,0,"check"]
["Mechanical & Electrical","M.9","Familiarity with Attachment Arrangement","Complete","Qual",null,0.13,null,1,0.1111111111111111,null,1.4444444444444444E-2,null,0,0,null,0,{"$f":"Q61*$L61","v":0},null,0,{"$f":"T61*$L61","v":0},null,0,{"$f":"W61*$L61","v":0},null,0,{"$f":"Z61*$L61","v":0},null,0,{"$f":"AC61*$L61","v":0},null,0,{"$f":"AF61*$L61","v":0},null,0,{"$f":"AI61*$L61","v":0},null,0,{"$f":"AL61*$L61","v":0},null,0,{"$f":"AO61*$L61","v":0},null,0,0,"check"]
["Mechanical & Electrical Totals",null,null,null,null,null,null,null,{"$f":"SUM(I53:I61)","v":9},{"$f":"SUM(J53:J61)","v":1.0000000000000002},null,{"$f":"SUM(L53:L61)","v":0.12999999999999998},null,{"$f":"SUM(O53:O61)","v":0},null,null,{"$f":"SUM(R53:R61)","v":0},null,null,{"$f":"SUM(U53:U61)","v":0},null,null,{"$f":"SUM(X53:X61)","v":0},null,null,{"$f":"SUM(AA53:AA61)","v":0},null,null,{"$f":"SUM(AD53:AD61)","v":0},null,null,{"$f":"SUM(AG53:AG61)","v":0},null,null,{"$f":"SUM(AJ53:AJ61)","v":0},null,null,{"$f":"SUM(AM53:AM61)","v":0},null,null,{"$f":"SUM(AP53:AP61)","v":0}]
["Construction ","C.1","Support Supply Chain Familiarity","Complete","Qual",null,{"$f":"$E$9","v":0.13},null,1,{"$f":"I63/$I$80","v":5.8823529411764705E-2},null,{"$f":"G63*J63","v":7.6470588235294122E-3},null,0,{"$f":"N63*$L63","v":0},null,0,{"$f":"Q63*$L63","v":0},null,0,{"$f":"T63*$L63","v":0},null,0,{"$f":"W63*$L63","v":0},null,0,{"$f":"Z63*$L63","v":0},null,0,{"$f":"AC63*$L63","v":0},null,0,{"$f":"AF63*$L63","v":0},null,0,{"$f":"AI63*$L63","v":0},null,0,{"$f":"AL63*$L63","v":0},null,0,{"$f":"AO63*$L63","v":0},null,0,0,"check"]
["Construction ","C.2","Insulation Supply Chain Familiarity (Composite)","Complete","Qual",null,0.13,null,1,5.8823529411764705E-2,null,{"$f":"G64*J64","v":7.6470588235294122E-3},null,0,{"$f":"N64*$L64","v":0},null,0,{"$f":"Q64*$L64","v":0},null,0,{"$f":"T64*$L64","v":0},null,0,{"$f":"W64*$L64","v":0},null,0,{"$f":"Z64*$L64","v":0},null,0,{"$f":"AC64*$L64","v":0},null,0,{"$f":"AF64*$L64","v":0},null,0,{"$f":"AI64*$L64","v":0},null,0,{"$f":"AL64*$L64","v":0},null,0,0,null,0,0,"check","OK","510 1, L8RD 9"]
["Construction ","C.3","Support Type testing","Complete","Qual",null,0.13,null,1,5.8823529411764705E-2,null,{"$f":"G65*J65","v":7.6470588235294122E-3},null,0,{"$f":"N65*$L65","v":0},null,0,{"$f":"Q65*$L65","v":0},null,0,{"$f":"T65*$L65","v":0},null,0,{"$f":"W65*$L65","v":0},null,0,{"$f":"Z65*$L65","v":0},null,0,{"$f":"AC65*$L65","v":0},null,0,{"$f":"AF65*$L65","v":0},null,0,{"$f":"AI65*$L65","v":0},null,0,{"$f":"AL65*$L65","v":0},null,0,0,null,0,0,"check","ok","Differentiate"]
["Construction ","C.4","Support check erect","Complete","Qual",null,0.13,null,1,5.8823529411764705E-2,null,{"$f":"G66*J66","v":7.6470588235294122E-3},null,0,{"$f":"N66*$L66","v":0},null,0,{"$f":"Q66*$L66","v":0},null,0,{"$f":"T66*$L66","v":0},null,0,{"$f":"W66*$L66","v":0},null,0,{"$f":"Z66*$L66","v":0},null,0,{"$f":"AC66*$L66","v":0},null,0,{"$f":"AF66*$L66","v":0},null,0,{"$f":"AI66*$L66","v":0},null,0,{"$f":"AL66*$L66","v":0},null,0,0,null,0,0,"check"]
["Construction ","C.5","Complexity of support (Fabrication)","Complete","Qual",null,0.13,null,1,5.8823529411764705E-2,null,7.6470588235294122E-3,null,0,0,null,0,0,null,0,0,null,0,0,null,0,0,null,0,0,null,0,0,null,0,0,null,0,0,null,0,0,null,0,0,"check"]
["Construction ","C.6","Area required for Foundation Construction","Complete","Qual",null,0.13,null,1,5.8823529411764705E-2,null,{"$f":"G68*J68","v":7.6470588235294122E-3},null,0,{"$f":"N68*$L68","v":0},null,0,{"$f":"Q68*$L68","v":0},null,0,{"$f":"T68*$L68","v":0},null,0,{"$f":"W68*$L68","v":0},null,0,{"$f":"Z68*$L68","v":0},null,0,{"$f":"AC68*$L68","v":0},null,0,{"$f":"AF68*$L68","v":0},null,0,{"$f":"AI68*$L68","v":0},null,0,{"$f":"AL68*$L68","v":0},null,0,0,null,0,0,"check"]
["Construction ","C.7","Area required for Assembly & Erection","Complete","Qual",null,0.13,null,1,5.8823529411764705E-2,null,{"$f":"G69*J69","v":7.6470588235294122E-3},null,0,{"$f":"N69*$L69","v":0},null,0,{"$f":"Q69*$L69","v":0},null,0,{"$f":"T69*$L69","v":0},null,0,{"$f":"W69*$L69","v":0},null,0,{"$f":"Z69*$L69","v":0},null,0,{"$f":"AC69*$L69","v":0},null,0,{"$f":"AF69*$L69","v":0},null,0,{"$f":"AI69*$L69","v":0},null,0,{"$f":"AL69*$L69","v":0},null,0,0,null,0,0,"check"]
["Construction ","C.8","Support Transport & Storage","Complete","Qual",null,0.13,null,1,5.8823529411764705E-2,null,7.6470588235294122E-3,null,0,0,null,0,0,null,0,0,null,0,0,null,0,0,null,0,0,null,0,0,null,0,0,null,0,0,null,0,0,null,0,0,"check"]
["Construction ","C.9","Access Track Requirement","Complete","Qual",null,0.13,null,1,5.8823529411764705E-2,null,7.6470588235294122E-3,null,0,0,null,0,0,null,0,0,null,0,0,null,0,0,null,0,0,null,0,0,null,0,0,null,0,0,null,0,0,null,0,0,"check"]
["Construction ","C.10","Ease of support assembly / erection","Complete","Qual",null,0.13,null,1,5.8823529411764705E-2,null,7.6470588235294122E-3,null,0,0,null,0,0,null,0,0,null,0,0,null,0,0,null,0,0,null,0,0,null,0,0,null,0,0,null,0,0,null,0,0,"check"]
["Construction ","C.11","Support access/ egress/ rescue","Complete","Qual",null,0.13,null,1,5.8823529411764705E-2,null,{"$f":"G73*J73","v":7.6470588235294122E-3},null,0,{"$f":"N73*$L73","v":0},null,0,{"$f":"Q73*$L73","v":0},null,0,{"$f":"T73*$L73","v":0},null,0,{"$f":"W73*$L73","v":0},null,0,{"$f":"Z73*$L73","v":0},null,0,{"$f":"AC73*$L73","v":0},null,0,{"$f":"AF73*$L73","v":0},null,0,{"$f":"AI73*$L73","v":0},null,0,{"$f":"AL73*$L73","v":0},null,0,{"$f":"AO73*$L73","v":0},null,0,0,"check"]
["Construction ","C.12","Need for insulator temporary restraint","Complete","Qual",null,0.13,null,1,5.8823529411764705E-2,null,{"$f":"G74*J74","v":7.6470588235294122E-3},null,0,{"$f":"N74*$L74","v":0},null,0,{"$f":"Q74*$L74","v":0},null,0,{"$f":"T74*$L74","v":0},null,0,{"$f":"W74*$L74","v":0},null,0,{"$f":"Z74*$L74","v":0},null,0,{"$f":"AC74*$L74","v":0},null,0,{"$f":"AF74*$L74","v":0},null,0,{"$f":"AI74*$L74","v":0},null,0,{"$f":"AL74*$L74","v":0},null,0,{"$f":"AO74*$L74","v":0},null,0,0,"check"]
["Construction ","C.13","Conductor Installation Process","Complete","Qual",null,0.13,null,1,5.8823529411764705E-2,null,7.6470588235294122E-3,null,0,0,null,0,0,null,0,0,null,0,0,null,0,0,null,0,0,null,0,0,null,0,0,null,0,0,null,0,0,null,0,0,"check"]
["Construction ","C.14","Insulator Conductor Attachment Point","Complete","Qual",null,0.13,null,1,5.8823529411764705E-2,null,7.6470588235294122E-3,null,0,0,null,0,0,null,0,0,null,0,0,null,0,0,null,0,0,null,0,0,null,0,0,null,0,0,null,0,0,null,0,0,"check"]
["Construction ","C.15","Refurbishment inc. e/w- 1 cct live proximity","Complete","Qual",null,0.13,null,1,5.8823529411764705E-2,null,{"$f":"G77*J77","v":7.6470588235294122E-3},null,0,{"$f":"N77*$L77","v":0},null,0,0,null,0,0,null,0,0,null,0,0,null,0,0,null,0,0,null,0,0,null,0,0,null,0,{"$f":"AO77*$L77","v":0},null,0,0,"check"]
["Construction ","C.16","Route Dismantling","Complete","Qual",null,0.13,null,1,5.8823529411764705E-2,null,{"$f":"G78*J78","v":7.6470588235294122E-3},null,0,{"$f":"N78*$L78","v":0},null,0,0,null,0,0,null,0,0,null,0,0,null,0,0,null,0,0,null,0,0,null,0,0,null,0,{"$f":"AO78*$L78","v":0},null,0,0,"check"]
["Construction ","C.17","Tension Support (Conductor Installation)","Complete","Qual",null,0.13,null,1,5.8823529411764705E-2,null,{"$f":"G79*J79","v":7.6470588235294122E-3},null,0,{"$f":"N79*$L79","v":0},null,0,0,null,0,0,null,0,0,null,0,0,null,0,0,null,0,0,null,0,0,null,0,0,null,0,{"$f":"AO79*$L79","v":0},null,0,0,"check"]
["Construction Totals",null,null,null,null,null,null,null,{"$f":"SUM(I63:I79)","v":17},{"$f":"SUM(J63:J79)","v":1},null,{"$f":"SUM(L63:L79)","v":0.12999999999999998},null,{"$f":"SUM(O63:O79)","v":0},null,null,{"$f":"SUM(R63:R79)","v":0},null,null,{"$f":"SUM(U63:U79)","v":0},null,null,{"$f":"SUM(X63:X79)","v":0},null,null,{"$f":"SUM(AA63:AA79)","v":0},null,null,{"$f":"SUM(AD63:AD79)","v":0},null,null,{"$f":"SUM(AG63:AG79)","v":0},null,null,{"$f":"SUM(AJ63:AJ79)","v":0},null,null,{"$f":"SUM(AM63:AM79)","v":0},null,null,{"$f":"SUM(AP63:AP79)","v":0}]
["Maintenance","R.1","Ancillary equipment (including third party)","Complete","Qual",null,{"$f":"$E$11","v":0.12},null,1,{"$f":"I81/$I$90","v":0.1111111111111111},null,{"$f":"G81*J81","v":1.3333333333333332E-2},null,0,{"$f":"N81*$L81","v":0},null,0,{"$f":"Q81*$L81","v":0},null,0,{"$f":"T81*$L81","v":0},null,0,{"$f":"W81*$L81","v":0},null,0,{"$f":"Z81*$L81","v":0},null,0,{"$f":"AC81*$L81","v":0},null,0,{"$f":"AF81*$L81","v":0},null,0,{"$f":"AI81*$L81","v":0},null,0,{"$f":"AL81*$L81","v":0},null,0,{"$f":"AO81*$L81","v":0},null,0,0,"check"]
["Maintenance","R.2","Main Component Replacement","Complete","Qual",null,0.12,null,1,0.1111111111111111,null,1.3333333333333332E-2,null,0,0,null,0,0,null,0,0,null,0,0,null,0,0,null,0,0,null,0,0,null,0,0,null,0,0,null,0,0,null,0,0,"check"]
["Maintenance","R.3","Suitability for operational activities (e.g. isolation)","Complete","Qual",null,0.12,null,1,0.1111111111111111,null,1.3333333333333332E-2,null,0,0,null,0,0,null,0,0,null,0,0,null,0,0,null,0,0,null,0,0,null,0,0,null,0,0,null,0,0,null,0,0,"check"]
["Maintenance","R.4","Main Component Replacement to Earthwires","Complete","Qual",null,0.12,null,1,0.1111111111111111,null,1.3333333333333332E-2,null,0,{"$f":"N84*$L84","v":0},null,0,0,null,0,0,null,0,0,null,0,0,null,0,0,null,0,0,null,0,0,null,0,0,null,0,{"$f":"AO84*$L84","v":0},null,0,0,"check"]
["Maintenance","R.5","Phase Conductor System Repairs - 1 cct live proximity","Complete","Qual",null,0.12,null,1,0.1111111111111111,null,1.3333333333333332E-2,null,0,{"$f":"N85*$L85","v":0},null,0,0,null,0,0,null,0,0,null,0,0,null,0,0,null,0,0,null,0,0,null,0,0,null,0,{"$f":"AO85*$L85","v":0},null,0,0,"check"]
["Maintenance","R.6","Earthwire Conductor System Repairs - 1cct live proximity","Complete","Qual",null,0.12,null,1,0.1111111111111111,null,1.3333333333333332E-2,null,0,0,null,0,0,null,0,0,null,0,0,null,0,0,null,0,0,null,0,0,null,0,0,null,0,0,null,0,0,null,0,0,"check"]
["Maintenance","R.7","Surface Preparation & Treatment/ Deterioration Protection","Complete","Qual",null,0.12,null,1,0.1111111111111111,null,1.3333333333333332E-2,null,0,0,null,0,0,null,0,0,null,0,0,null,0,0,null,0,0,null,0,0,null,0,0,null,0,0,null,0,0,null,0,0,"check"]
["Maintenance","R.8","Condition Assessment Remote (Ground/ Aerial)","Complete","Qual",null,0.12,null,1,0.1111111111111111,null,1.3333333333333332E-2,null,0,0,null,0,0,null,0,0,null,0,0,null,0,0,null,0,0,null,0,0,null,0,0,null,0,0,null,0,0,null,0,0,"check"]
["Maintenance","R.9","Condition Assessment Intrusive (Climbing)","Complete","Qual",null,0.12,null,1,0.1111111111111111,null,1.3333333333333332E-2,null,0,0,null,0,0,null,0,0,null,0,0,null,0,0,null,0,0,null,0,0,null,0,0,null,0,0,null,0,0,null,0,0,"check"]
["Maintenance Totals",null,null,null,null,null,null,null,{"$f":"SUM(I81:I89)","v":9},{"$f":"SUM(J81:J89)","v":1.0000000000000002},null,{"$f":"SUM(L81:L89)","v":0.12000000000000001},null,{"$f":"SUM(O81:O89)","v":0},null,null,{"$f":"SUM(R81:R89)","v":0},null,null,{"$f":"SUM(U81:U89)","v":0},null,null,{"$f":"SUM(X81:X89)","v":0},null,null,{"$f":"SUM(AA81:AA89)","v":0},null,null,{"$f":"SUM(AD81:AD89)","v":0},null,null,{"$f":"SUM(AG81:AG89)","v":0},null,null,{"$f":"SUM(AJ81:AJ89)","v":0},null,null,{"$f":"SUM(AM81:AM89)","v":0},null,null,{"$f":"SUM(AP81:AP89)","v":0}]
["Operational Safety","O.1","Access/ Egress/ Rescue","Complete","Qual",null,{"$f":"$E$13","v":0.12},null,1,{"$f":"I91/$I$95","v":0.25},null,{"$f":"G91*J91","v":0.03},null,0,{"$f":"N91*$L91","v":0},null,0,{"$f":"Q91*$L91","v":0},null,0,{"$f":"T91*$L91","v":0},null,0,{"$f":"W91*$L91","v":0},null,0,{"$f":"Z91*$L91","v":0},null,0,{"$f":"AC91*$L91","v":0},null,0,{"$f":"AF91*$L91","v":0},null,0,{"$f":"AI91*$L91","v":0},null,0,{"$f":"AL91*$L91","v":0},null,0,{"$f":"AO91*$L91","v":0},null,{"$f":"MIN(N91,Q91,W91,Z91,AC91,AF91,AI91,AL91,AO91)","v":0},{"$f":"MAX(N91,Q91,W91,Z91,AC91,AF91,AI91,AL91,AO91)","v":0},{"$f":"IF(AND(AR91=1,AS91=9),\"\",\"check\")","v":"check"}]
["Operational Safety","O.2","Live line working","Complete","Qual",null,{"$f":"$E$13","v":0.12},null,1,{"$f":"I92/$I$95","v":0.25},null,0.03,null,0,0,null,0,0,null,0,0,null,0,{"$f":"W92*$L92","v":0},null,0,0,null,0,0,null,0,0,null,0,0,null,0,0,null,0,0,null,0,0,"check"]
["Operational Safety","O.3","Management of Induced voltages / currents / Application of additional earthing","Complete","Qual",null,{"$f":"$E$13","v":0.12},null,1,{"$f":"I93/$I$95","v":0.25},null,{"$f":"G93*J93","v":0.03},null,0,0,null,0,0,null,0,0,null,0,{"$f":"W93*$L93","v":0},null,0,0,null,0,0,null,0,0,null,0,0,null,0,0,null,0,{"$f":"AO93*$L93","v":0},null,0,0,"check"]
["Operational Safety","O.4","Circuit Demarcation","Complete","Qual",null,{"$f":"$E$13","v":0.12},null,1,{"$f":"I94/$I$95","v":0.25},null,{"$f":"G94*J94","v":0.03},null,0,0,null,0,0,null,0,0,null,0,0,null,0,0,null,0,0,null,0,0,null,0,0,null,0,0,null,0,{"$f":"AO94*$L94","v":0},null,0,0,"check"]
["Operational Safety Totals",null,null,null,null,null,null,null,{"$f":"SUM(I91:I94)","v":4},{"$f":"SUM(J91:J94)","v":1},null,{"$f":"SUM(L91:L94)","v":0.12},null,{"$f":"SUM(O91:O94)","v":0},null,null,{"$f":"SUM(R91:R94)","v":0},null,null,{"$f":"SUM(U91:U94)","v":0},null,null,{"$f":"SUM(X91:X94)","v":0},null,null,{"$f":"SUM(AA91:AA94)","v":0},null,null,{"$f":"SUM(AD91:AD94)","v":0},null,null,{"$f":"SUM(AG91:AG94)","v":0},null,null,{"$f":"SUM(AJ91:AJ94)","v":0},null,null,{"$f":"SUM(AM91:AM94)","v":0},null,null,{"$f":"SUM(AP91:AP94)","v":0}]
["Environmental","P.1","Height","Complete","Quant've",null,{"$f":"$E$15","v":0.12},null,1,{"$f":"I96/$I$108","v":8.3333333333333329E-2},null,{"$f":"G96*J96","v":9.9999999999999985E-3},null,0,{"$f":"N96*$L96","v":0},null,0,{"$f":"Q96*$L96","v":0},null,0,{"$f":"T96*$L96","v":0},null,0,{"$f":"W96*$L96","v":0},null,0,{"$f":"Z96*$L96","v":0},null,0,{"$f":"AC96*$L96","v":0},null,0,{"$f":"AF96*$L96","v":0},null,0,{"$f":"AI96*$L96","v":0},null,0,{"$f":"AL96*$L96","v":0},null,0,{"$f":"AO96*$L96","v":0},null,0,0,"check"]
["Environmental","P.2","Supports per km","Complete","Quant've",null,0.12,null,1,8.3333333333333329E-2,null,9.9999999999999985E-3,null,0,0,null,0,0,null,0,0,null,0,0,null,0,{"$f":"Z97*$L97","v":0},null,0,0,null,0,0,null,0,0,null,0,0,null,0,0,null,0,0,"check"]
["Environmental","P.3","Insulator Visual Impact","Complete","Qual",null,0.12,null,1,8.3333333333333329E-2,null,9.9999999999999985E-3,null,0,0,null,0,0,null,0,0,null,0,0,null,0,{"$f":"Z98*$L98","v":0},null,0,0,null,0,0,null,0,0,null,0,0,null,0,0,null,0,0,"check"]
["Environmental","P.4","Transparency (Back clothing)","Complete","Qual",null,0.12,null,1,8.3333333333333329E-2,null,9.9999999999999985E-3,null,0,0,null,0,0,null,0,0,null,0,0,null,0,0,null,0,0,null,0,0,null,0,0,null,0,0,null,0,0,null,0,0,"check"]
["Environmental","P.5","Conductor Arrangement (Compact/ Open)","Complete","Qual",null,0.12,null,1,8.3333333333333329E-2,null,9.9999999999999985E-3,null,0,0,null,0,0,null,0,0,null,0,0,null,0,0,null,0,0,null,0,0,null,0,0,null,0,0,null,0,0,null,0,0,"check"]
["Environmental","P.6","Support  shape (eiffelised/ top heavy etc.)","Complete","Qual",null,0.12,null,1,8.3333333333333329E-2,null,9.9999999999999985E-3,null,0,0,null,0,0,null,0,0,null,0,0,null,0,0,null,0,0,null,0,0,null,0,0,null,0,0,null,0,0,null,0,0,"check"]
["Environmental","P.7","Cross arms","Complete","Qual",null,0.12,null,1,8.3333333333333329E-2,null,{"$f":"G102*J102","v":9.9999999999999985E-3},null,0,{"$f":"N102*$L102","v":0},null,0,0,null,0,0,null,0,0,null,0,0,null,0,0,null,0,0,null,0,0,null,0,0,null,0,{"$f":"AO102*$L102","v":0},null,0,0,"check"]
["Environmental","P.8","Design aesthetics","Complete","Qual",null,0.12,null,1,8.3333333333333329E-2,null,{"$f":"G103*J103","v":9.9999999999999985E-3},null,0,{"$f":"N103*$L103","v":0},null,0,0,null,0,0,null,0,0,null,0,0,null,0,0,null,0,0,null,0,0,null,0,0,null,0,{"$f":"AO103*$L103","v":0},null,0,0,"check"]
["Environmental","P.9","Corridor Width","Complete","Quant've",null,0.12,null,1,8.3333333333333329E-2,null,{"$f":"G104*J104","v":9.9999999999999985E-3},null,0,{"$f":"N104*$L104","v":0},null,0,{"$f":"Q104*$L104","v":0},null,0,{"$f":"T104*$L104","v":0},null,0,{"$f":"W104*$L104","v":0},null,0,{"$f":"Z104*$L104","v":0},null,0,{"$f":"AC104*$L104","v":0},null,0,{"$f":"AF104*$L104","v":0},null,0,{"$f":"AI104*$L104","v":0},null,0,{"$f":"AL104*$L104","v":0},null,0,{"$f":"AO104*$L104","v":0},null,0,0,"check"]
["Environmental","P.10","As Built Footprint","Complete","Quant've",null,0.12,null,1,8.3333333333333329E-2,null,9.9999999999999985E-3,null,0,{"$f":"N105*$L105","v":0},null,0,{"$f":"Q105*$L105","v":0},null,0,{"$f":"T105*$L105","v":0},null,0,{"$f":"W105*$L105","v":0},null,0,{"$f":"Z105*$L105","v":0},null,0,{"$f":"AC105*$L105","v":0},null,0,{"$f":"AF105*$L105","v":0},null,0,{"$f":"AI105*$L105","v":0},null,0,{"$f":"AL105*$L105","v":0},null,0,0,null,0,0,"check"]
["Environmental","P.11","Effect on Birds","Complete","Semi-quant",null,0.12,null,1,8.3333333333333329E-2,null,9.9999999999999985E-3,null,0,0,null,0,{"$f":"Q106*$L106","v":0},null,0,{"$f":"T106*$L106","v":0},null,0,{"$f":"W106*$L106","v":0},null,0,{"$f":"Z106*$L106","v":0},null,0,{"$f":"AC106*$L106","v":0},null,0,{"$f":"AF106*$L106","v":0},null,0,{"$f":"AI106*$L106","v":0},null,0,{"$f":"AL106*$L106","v":0},null,0,0,null,0,0,"check"]
["Environmental","P.12","Tension Support Continuity","Complete","Qual",null,0.12,null,1,8.3333333333333329E-2,null,9.9999999999999985E-3,null,0,0,null,0,{"$f":"Q107*$L107","v":0},null,0,{"$f":"T107*$L107","v":0},null,0,{"$f":"W107*$L107","v":0},null,0,{"$f":"Z107*$L107","v":0},null,0,{"$f":"AC107*$L107","v":0},null,0,{"$f":"AF107*$L107","v":0},null,0,{"$f":"AI107*$L107","v":0},null,0,{"$f":"AL107*$L107","v":0},null,0,0,null,0,0,"check"]
["Environmental Totals",null,null,null,null,null,null,null,{"$f":"SUM(I96:I107)","v":12},{"$f":"SUM(J96:J107)","v":1},null,{"$f":"SUM(L96:L107)","v":0.11999999999999995},null,{"$f":"SUM(O96:O107)","v":0},null,null,{"$f":"SUM(R96:R107)","v":0},null,null,{"$f":"SUM(U96:U107)","v":0},null,null,{"$f":"SUM(X96:X107)","v":0},null,null,{"$f":"SUM(AA96:AA107)","v":0},null,null,{"$f":"SUM(AD96:AD107)","v":0},null,null,{"$f":"SUM(AG96:AG107)","v":0},null,null,{"$f":"SUM(AJ96:AJ107)","v":0},null,null,{"$f":"SUM(AM96:AM107)","v":0},null,null,{"$f":"SUM(AP96:AP107)","v":0}]
["Other","T.1","Susceptibility to damage (vandalism/accident)","Provisional","Qual",null,{"$f":"$E$17","v":0.12},null,1,{"$f":"I109/$I$115","v":0.16666666666666666},null,{"$f":"G109*J109","v":1.9999999999999997E-2},null,0,{"$f":"N109*$L109","v":0},null,0,{"$f":"Q109*$L109","v":0},null,0,{"$f":"T109*$L109","v":0},null,0,{"$f":"W109*$L109","v":0},null,0,{"$f":"Z109*$L109","v":0},null,0,{"$f":"AC109*$L109","v":0},null,0,{"$f":"AF109*$L109","v":0},null,0,{"$f":"AI109*$L109","v":0},null,0,{"$f":"AL109*$L109","v":0},null,0,{"$f":"AO109*$L109","v":0},null,0,0,"check"]
["Other","T.2","Resistance of materials to deterioration/attack","Provisional","Qual",null,0.12,null,1,{"$f":"I110/$I$115","v":0.16666666666666666},null,1.9999999999999997E-2,null,0,0,null,0,0,null,0,0,null,0,0,null,0,0,null,0,0,null,0,0,null,0,0,null,0,0,null,0,0,null,0,0,"check","ok"]
["Other","T.3","Number of supports per km of OHL","Provisional","Quant've",null,0.12,null,1,{"$f":"I111/$I$115","v":0.16666666666666666},null,1.9999999999999997E-2,null,0,{"$f":"N111*$L111","v":0},null,0,0,null,0,0,null,0,0,null,0,0,null,0,0,null,0,0,null,0,0,null,0,0,null,0,0,null,0,0,"check"]
["Other","T.4","Embodied energy (embodied carbon)","Provisional","Quant've",null,0.12,null,1,{"$f":"I112/$I$115","v":0.16666666666666666},null,1.9999999999999997E-2,null,0,{"$f":"N112*$L112","v":0},null,0,0,null,0,0,null,0,0,null,0,0,null,0,0,null,0,0,null,0,0,null,0,0,null,0,0,null,0,0,"check"]
["Other","T.5","Cost of supports (per km)","Provisional","Quant've",null,0.12,null,1,0.16666666666666666,null,1.9999999999999997E-2,null,0,{"$f":"N113*$L113","v":0},null,0,{"$f":"Q113*$L113","v":0},null,0,{"$f":"T113*$L113","v":0},null,0,{"$f":"W113*$L113","v":0},null,0,{"$f":"Z113*$L113","v":0},null,0,{"$f":"AC113*$L113","v":0},null,0,{"$f":"AF113*$L113","v":0},null,0,{"$f":"AI113*$L113","v":0},null,0,{"$f":"AL113*$L113","v":0},null,0,{"$f":"AO113*$L113","v":0},null,0,0,"check"]
["Other","T.6","Side slope - effect on height","Provisional","Quant've",null,0.12,null,1,{"$f":"I114/$I$115","v":0.16666666666666666},null,1.9999999999999997E-2,null,0,0,null,0,0,null,0,0,null,0,0,null,0,0,null,0,0,null,0,0,null,0,0,null,0,0,null,0,0,null,0,0,"check"]
["Other Totals",null,null,null,null,null,null,null,{"$f":"SUM(I109:I114)","v":6},{"$f":"SUM(J109:J114)","v":0.99999999999999989},null,{"$f":"SUM(L109:L114)","v":0.11999999999999997},null,{"$f":"SUM(O109:O114)","v":0},null,null,{"$f":"SUM(R109:R114)","v":0},null,null,{"$f":"SUM(U109:U114)","v":0},null,null,{"$f":"SUM(X109:X114)","v":0},null,null,{"$f":"SUM(AA109:AA114)","v":0},null,null,{"$f":"SUM(AD109:AD114)","v":0},null,null,{"$f":"SUM(AG109:AG114)","v":0},null,null,{"$f":"SUM(AJ109:AJ114)","v":0},null,null,{"$f":"SUM(AM109:AM114)","v":0},null,null,{"$f":"SUM(AP109:AP114)","v":0}]
[]
[]
[]
["Provisional"]
["Complete"]
[]
["Quant've"]
["Semi-quant"]
["Qual"]
[]
[]
[]
[]
[]
[]
[null,null,null,null,null,null,null,null,null,null,null,null,null,null,null,null,null,null,null,null,null,null,null,null,null,null,null,null,null,null,null,null,null,null,null,null,null,null,null,null,null,null,null,null,"Max","Min"]
[null,null,null,null,null,null,null,null,{"$f":"A3","v":"Electrical"},null,null,null,null,null,{"$f":"N$36*10","v":0},null,null,{"$f":"Q$36*10","v":0},null,null,null,null,null,{"$f":"W$36*10","v":0},null,null,{"$f":"Z$36*10","v":0},null,null,{"$f":"AC$36*10","v":0},null,null,{"$f":"AF$36*10","v":0},null,null,{"$f":"AI$36*10","v":0},null,null,{"$f":"AL$36*10","v":0},null,null,{"$f":"AO$36*10","v":0},null,null,{"$f":"MAX(O132,R132,X132,AA132,AD132,AG132,AJ132,AM132,AP132)","v":0},{"$f":"MIN(O132,R132,X132,AA132,AD132,AG132,AJ132,AM132,AP132)","v":0}]
[null,null,null,null,null,null,null,null,{"$f":"A5","v":"Supports & Foundations"},null,null,null,null,null,{"$f":"N$52*10","v":0},null,null,{"$f":"Q$52*10","v":0},null,null,null,null,null,{"$f":"W$52*10","v":0},null,null,{"$f":"Z$52*10","v":0},null,null,{"$f":"AC$52*10","v":0},null,null,{"$f":"AF$52*10","v":0},null,null,{"$f":"AI$52*10","v":0},null,null,{"$f":"AL$52*10","v":0},null,null,{"$f":"AO$52*10","v":0},null,null,0,0]
[null,null,null,null,null,null,null,null,{"$f":"A7","v":"Mechanical & Electrical"},null,null,null,null,null,{"$f":"N62*10","v":0},null,null,{"$f":"Q62*10","v":0},null,null,null,null,null,{"$f":"W62*10","v":0},null,null,{"$f":"Z62*10","v":0},null,null,{"$f":"AC62*10","v":0},null,null,{"$f":"AF62*10","v":0},null,null,{"$f":"AI62*10","v":0},null,null,{"$f":"AL62*10","v":0},null,null,{"$f":"AO62*10","v":0},null,null,0,0]
[null,null,null,null,null,null,null,null,{"$f":"A9","v":"Construction "},null,null,null,null,null,{"$f":"N80*10","v":0},null,null,{"$f":"Q80*10","v":0},null,null,null,null,null,{"$f":"W80*10","v":0},null,null,{"$f":"Z80*10","v":0},null,null,{"$f":"AC80*10","v":0},null,null,{"$f":"AF80*10","v":0},null,null,{"$f":"AI80*10","v":0},null,null,{"$f":"AL80*10","v":0},null,null,{"$f":"AO80*10","v":0},null,null,0,0]
[null,null,null,null,null,null,null,null,{"$f":"A11","v":"Maintenance"},null,null,null,null,null,{"$f":"N90*10","v":0},null,null,{"$f":"Q90*10","v":0},null,null,null,null,null,{"$f":"W90*10","v":0},null,null,{"$f":"Z90*10","v":0},null,null,{"$f":"AC90*10","v":0},null,null,{"$f":"AF90*10","v":0},null,null,{"$f":"AI90*10","v":0},null,null,{"$f":"AL90*10","v":0},null,null,{"$f":"AO90*10","v":0},null,null,0,0]
[null,null,null,null,null,null,null,null,{"$f":"A13","v":"Operational Safety"},null,null,null,null,null,{"$f":"N95*10","v":0},null,null,{"$f":"Q95*10","v":0},null,null,null,null,null,{"$f":"W95*10","v":0},null,null,{"$f":"Z95*10","v":0},null,null,{"$f":"AC95*10","v":0},null,null,{"$f":"AF95*10","v":0},null,null,{"$f":"AI95*10","v":0},null,null,{"$f":"AL95*10","v":0},null,null,{"$f":"AO95*10","v":0},null,null,0,0]
[null,null,null,null,null,null,null,null,{"$f":"A15","v":"Environmental"},null,null,null,null,null,{"$f":"N108*10","v":0},null,null,{"$f":"Q108*10","v":0},null,null,null,null,null,{"$f":"W108*10","v":0},null,null,{"$f":"Z108*10","v":0},null,null,{"$f":"AC108*10","v":0},null,null,{"$f":"AF108*10","v":0},null,null,{"$f":"AI108*10","v":0},null,null,{"$f":"AL108*10","v":0},null,null,{"$f":"AO108*10","v":0},null,null,0,0]
[null,null,null,null,null,null,null,null,{"$f":"A17","v":"Other"},null,null,null,null,null,{"$f":"N115*10","v":0},null,null,{"$f":"Q115*10","v":0},null,null,null,null,null,{"$f":"W115*10","v":0},null,null,{"$f":"Z115*10","v":0},null,null,{"$f":"AC115*10","v":0},null,null,{"$f":"AF115*10","v":0},null,null,{"$f":"AI115*10","v":0},null,null,{"$f":"AL115*10","v":0},null,null,{"$f":"AO115*10","v":0},null,null,0,0]
[]
[null,null,null,null,null,null,null,null,null,null,null,null,null,null,{"$f":"SUM(O132:O139)","v":0},null,null,{"$f":"SUM(R132:R139)","v":0},null,null,null,null,null,{"$f":"SUM(X132:X139)","v":0},null,null,{"$f":"SUM(AA132:AA139)","v":0},null,null,{"$f":"SUM(AD132:AD139)","v":0},null,null,{"$f":"SUM(AG132:AG139)","v":0},null,null,{"$f":"SUM(AJ132:AJ139)","v":0},null,null,{"$f":"SUM(AM132:AM139)","v":0},null,null,{"$f":"SUM(AP132:AP139)","v":0}]
[]
["Main Design Aspect summaries"]
[null,null,{"$f":"A26","v":"Electrical"},null,null,null,null,null,null,null,null,null,null,{"$f":"N36","v":0},null,null,{"$f":"Q36","v":0},null,null,{"$f":"T36","v":0},null,null,{"$f":"W36","v":0},null,null,{"$f":"Z36","v":0},null,null,{"$f":"AC36","v":0},null,null,{"$f":"AF36","v":0},null,null,{"$f":"AI36","v":0},null,null,{"$f":"AL36","v":0},null,null,{"$f":"AO36","v":0}]
[null,null,{"$f":"A37","v":"Supports & Foundations"},null,null,null,null,null,null,null,null,null,null,{"$f":"N52","v":0},null,null,{"$f":"Q52","v":0},null,null,{"$f":"T52","v":0},null,null,{"$f":"W52","v":0},null,null,{"$f":"Z52","v":0},null,null,{"$f":"AC52","v":0},null,null,{"$f":"AF52","v":0},null,null,{"$f":"AI52","v":0},null,null,{"$f":"AL52","v":0},null,null,{"$f":"AO52","v":0}]
[null,null,{"$f":"A53","v":"Mechanical & Electrical"},null,null,null,null,null,null,null,null,null,null,{"$f":"N62","v":0},null,null,{"$f":"Q62","v":0},null,null,{"$f":"T62","v":0},null,null,{"$f":"W62","v":0},null,null,{"$f":"Z62","v":0},null,null,{"$f":"AC62","v":0},null,null,{"$f":"AF62","v":0},null,null,{"$f":"AI62","v":0},null,null,{"$f":"AL62","v":0},null,null,{"$f":"AO62","v":0}]
[null,null,{"$f":"A63","v":"Construction "},null,null,null,null,null,null,null,null,null,null,{"$f":"N80","v":0},null,null,{"$f":"Q80","v":0},null,null,{"$f":"T80","v":0},null,null,{"$f":"W80","v":0},null,null,{"$f":"Z80","v":0},null,null,{"$f":"AC80","v":0},null,null,{"$f":"AF80","v":0},null,null,{"$f":"AI80","v":0},null,null,{"$f":"AL80","v":0},null,null,{"$f":"AO80","v":0}]
[null,null,{"$f":"A81","v":"Maintenance"},null,null,null,null,null,null,null,null,null,null,{"$f":"N90","v":0},null,null,{"$f":"Q90","v":0},null,null,{"$f":"T90","v":0},null,null,{"$f":"W90","v":0},null,null,{"$f":"Z90","v":0},null,null,{"$f":"AC90","v":0},null,null,{"$f":"AF90","v":0},null,null,{"$f":"AI90","v":0},null,null,{"$f":"AL90","v":0},null,null,{"$f":"AO90","v":0}]
[null,null,{"$f":"A91","v":"Operational Safety"},null,null,null,null,null,null,null,null,null,null,{"$f":"N95","v":0},null,null,{"$f":"Q95","v":0},null,null,{"$f":"T95","v":0},null,null,{"$f":"W95","v":0},null,null,{"$f":"Z95","v":0},null,null,{"$f":"AC95","v":0},null,null,{"$f":"AF95","v":0},null,null,{"$f":"AI95","v":0},null,null,{"$f":"AL95","v":0},null,null,{"$f":"AO95","v":0}]
[null,null,{"$f":"A96","v":"Environmental"},null,null,null,null,null,null,null,null,null,null,{"$f":"N108","v":0},null,null,{"$f":"Q108","v":0},null,null,{"$f":"T108","v":0},null,null,{"$f":"W108","v":0},null,null,{"$f":"Z108","v":0},null,null,{"$f":"AC108","v":0},null,null,{"$f":"AF108","v":0},null,null,{"$f":"AI108","v":0},null,null,{"$f":"AL108","v":0},null,null,{"$f":"AO108","v":0}]
[null,null,{"$f":"A109","v":"Other"},null,null,null,null,null,null,null,null,null,null,{"$f":"N115","v":0},null,null,{"$f":"Q115","v":0},null,null,{"$f":"T115","v":0},null,null,{"$f":"W115","v":0},null,null,{"$f":"Z115","v":0},null,null,{"$f":"AC115","v":0},null,null,{"$f":"AF115","v":0},null,null,{"$f":"AI115","v":0},null,null,{"$f":"AL115","v":0},null,null,{"$f":"AO115","v":0}]
[]
["Relative changes in ratings compared to Benchmark support (L8RD M4.9)"]
[]
[null,null,null,null,null,null,null,null,null,null,null,null,null,null,"L8RD",null,{"$f":"Q1","v":"Support 1"},null,null,{"$f":"T1","v":"Support 2"},null,null,{"$f":"W1","v":"Support 3"},null,null,{"$f":"Z1","v":"Support 4"},null,null,{"$f":"AC1","v":"Support 5"},null,null,{"$f":"AF1","v":"Support 6"},null,null,{"$f":"AI1","v":"Support 7"},null,null,{"$f":"AL1","v":"Support 8"},null,null,{"$f":"AO1","v":"Support 9"}]
[null,null,null,null,null,null,null,null,null,null,null,null,null,"MDA","Rating",null,"Rating","% Diff",null,"Rating","% Diff",null,"Rating","% Diff",null,"Rating","% Diff",null,"Rating","% Diff",null,"Rating","% Diff",null,"Rating","% Diff",null,"Rating","% Diff",null,"Rating","% Diff"]
[null,null,null,null,null,null,null,null,null,null,null,null,null,"Elect",{"$f":"N36*10","v":0},null,{"$f":"Q36*10","v":0},{"$f":"IF(Q157-$O$164=0,\"NoChange\",(Q157-$O157)/$O157*100)","v":"NoChange"},null,{"$f":"T36*10","v":0},{"$f":"IF(T157-$O$164=0,\"NoChange\",(T157-$O157)/$O157*100)","v":"NoChange"},null,{"$f":"W36*10","v":0},{"$f":"IF(W157-$O$164=0,\"NoChange\",(W157-$O157)/$O157*100)","v":"NoChange"},null,{"$f":"Z36*10","v":0},{"$f":"IF(Z157-$O$164=0,\"NoChange\",(Z157-$O157)/$O157*100)","v":"NoChange"},null,{"$f":"AC36*10","v":0},{"$f":"IF(AC157-$O$164=0,\"NoChange\",(AC157-$O157)/$O157*100)","v":"NoChange"},null,{"$f":"AF36*10","v":0},{"$f":"IF(AF157-$O$164=0,\"NoChange\",(AF157-$O157)/$O157*100)","v":"NoChange"},null,{"$f":"AI36*10","v":0},{"$f":"IF(AI157-$O$164=0,\"NoChange\",(AI157-$O157)/$O157*100)","v":"NoChange"},null,{"$f":"AL36*10","v":0},{"$f":"IF(AL157-$O$164=0,\"NoChange\",(AL157-$O157)/$O157*100)","v":"NoChange"},null,{"$f":"AO36*10","v":0},{"$f":"IF(AO157-$O$164=0,\"NoChange\",(AO157-$O157)/$O157*100)","v":"NoChange"}]
[null,null,null,null,null,null,null,null,null,null,null,null,null,"Struct&F",{"$f":"N52*10","v":0},null,{"$f":"Q52*10","v":0},"NoChange",null,{"$f":"T52*10","v":0},"NoChange",null,{"$f":"W52*10","v":0},"NoChange",null,{"$f":"Z52*10","v":0},"NoChange",null,{"$f":"AC52*10","v":0},"NoChange",null,{"$f":"AF52*10","v":0},"NoChange",null,{"$f":"AI52*10","v":0},"NoChange",null,{"$f":"AL52*10","v":0},"NoChange",null,{"$f":"AO52*10","v":0},"NoChange"]
[null,null,null,null,null,null,null,null,null,null,null,null,null,"Mech&El",{"$f":"N62*10","v":0},null,{"$f":"Q62*10","v":0},"NoChange",null,{"$f":"T62*10","v":0},"NoChange",null,{"$f":"W62*10","v":0},"NoChange",null,{"$f":"Z62*10","v":0},"NoChange",null,{"$f":"AC62*10","v":0},"NoChange",null,{"$f":"AF62*10","v":0},"NoChange",null,{"$f":"AI62*10","v":0},"NoChange",null,{"$f":"AL62*10","v":0},"NoChange",null,{"$f":"AO62*10","v":0},"NoChange"]
[null,null,null,null,null,null,null,null,null,null,null,null,null,"Constr",{"$f":"N80*10","v":0},null,{"$f":"Q80*10","v":0},"NoChange",null,{"$f":"T80*10","v":0},"NoChange",null,{"$f":"W80*10","v":0},"NoChange",null,{"$f":"Z80*10","v":0},"NoChange",null,{"$f":"AC80*10","v":0},"NoChange",null,{"$f":"AF80*10","v":0},"NoChange",null,{"$f":"AI80*10","v":0},"NoChange",null,{"$f":"AL80*10","v":0},"NoChange",null,{"$f":"AO80*10","v":0},"NoChange"]
[null,null,null,null,null,null,null,null,null,null,null,null,null,"Maint",{"$f":"N90*10","v":0},null,{"$f":"Q90*10","v":0},"NoChange",null,{"$f":"T90*10","v":0},"NoChange",null,{"$f":"W90*10","v":0},"NoChange",null,{"$f":"Z90*10","v":0},"NoChange",null,{"$f":"AC90*10","v":0},"NoChange",null,{"$f":"AF90*10","v":0},"NoChange",null,{"$f":"AI90*10","v":0},"NoChange",null,{"$f":"AL90*10","v":0},"NoChange",null,{"$f":"AO90*10","v":0},"NoChange"]
[null,null,null,null,null,null,null,null,null,null,null,null,null,"OperSafety",{"$f":"N95*10","v":0},null,{"$f":"Q95*10","v":0},"NoChange",null,{"$f":"T95*10","v":0},"NoChange",null,{"$f":"W95*10","v":0},"NoChange",null,{"$f":"Z95*10","v":0},"NoChange",null,{"$f":"AC95*10","v":0},"NoChange",null,{"$f":"AF95*10","v":0},"NoChange",null,{"$f":"AI95*10","v":0},"NoChange",null,{"$f":"AL95*10","v":0},"NoChange",null,{"$f":"AO95*10","v":0},"NoChange"]
[null,null,null,null,null,null,null,null,null,null,null,null,null,"Env",{"$f":"N108*10","v":0},null,{"$f":"Q108*10","v":0},{"$f":"IF(Q163-$O$164=0,\"NoChange\",(Q163-$O163)/$O163*100)","v":"NoChange"},null,{"$f":"T108*10","v":0},{"$f":"IF(T163-$O$164=0,\"NoChange\",(T163-$O163)/$O163*100)","v":"NoChange"},null,{"$f":"W108*10","v":0},{"$f":"IF(W163-$O$164=0,\"NoChange\",(W163-$O163)/$O163*100)","v":"NoChange"},null,{"$f":"Z108*10","v":0},{"$f":"IF(Z163-$O$164=0,\"NoChange\",(Z163-$O163)/$O163*100)","v":"NoChange"},null,{"$f":"AC108*10","v":0},{"$f":"IF(AC163-$O$164=0,\"NoChange\",(AC163-$O163)/$O163*100)","v":"NoChange"},null,{"$f":"AF108*10","v":0},{"$f":"IF(AF163-$O$164=0,\"NoChange\",(AF163-$O163)/$O163*100)","v":"NoChange"},null,{"$f":"AI108*10","v":0},{"$f":"IF(AI163-$O$164=0,\"NoChange\",(AI163-$O163)/$O163*100)","v":"NoChange"},null,{"$f":"AL108*10","v":0},{"$f":"IF(AL163-$O$164=0,\"NoChange\",(AL163-$O163)/$O163*100)","v":"NoChange"},null,{"$f":"AO108*10","v":0},{"$f":"IF(AO163-$O$164=0,\"NoChange\",(AO163-$O163)/$O163*100)","v":"NoChange"}]
[null,null,null,null,null,null,null,null,null,null,null,null,null,"Other",{"$f":"N115*10","v":0},null,{"$f":"Q115*10","v":0},{"$f":"IF(Q164-$O$164=0,\"NoChange\",(Q164-$O164)/$O164*100)","v":"NoChange"},null,{"$f":"T115*10","v":0},{"$f":"IF(T164-$O$164=0,\"NoChange\",(T164-$O164)/$O164*100)","v":"NoChange"},null,{"$f":"W115*10","v":0},{"$f":"IF(W164-$O$164=0,\"NoChange\",(W164-$O164)/$O164*100)","v":"NoChange"},null,{"$f":"Z115*10","v":0},{"$f":"IF(Z164-$O$164=0,\"NoChange\",(Z164-$O164)/$O164*100)","v":"NoChange"},null,{"$f":"AC115*10","v":0},{"$f":"IF(AC164-$O$164=0,\"NoChange\",(AC164-$O164)/$O164*100)","v":"NoChange"},null,{"$f":"AF115*10","v":0},{"$f":"IF(AF164-$O$164=0,\"NoChange\",(AF164-$O164)/$O164*100)","v":"NoChange"},null,{"$f":"AI115*10","v":0},{"$f":"IF(AI164-$O$164=0,\"NoChange\",(AI164-$O164)/$O164*100)","v":"NoChange"},null,{"$f":"AL115*10","v":0},{"$f":"IF(AL164-$O$164=0,\"NoChange\",(AL164-$O164)/$O164*100)","v":"NoChange"},null,{"$f":"AO115*10","v":0},{"$f":"IF(AO164-$O$164=0,\"NoChange\",(AO164-$O164)/$O164*100)","v":"NoChange"}]
[]
[null,null,null,null,null,null,null,null,null,null,null,null,null,"Overall",{"$f":"N23","v":0},null,{"$f":"Q23","v":0},{"$f":"IF(Q166-O166=0,\"NoChange\",(Q166-$O166)/$O166*100)","v":"NoChange"},null,{"$f":"T23","v":0},{"$f":"IF(T166-R166=0,\"NoChange\",(T166-$O166)/$O166*100)","v":{"$error":"#VALUE!"}},null,{"$f":"W23","v":0},{"$f":"IF(W166-Q166=0,\"NoChange\",(W166-$O166)/$O166*100)","v":"NoChange"},null,{"$f":"Z23","v":0},{"$f":"IF(Z166-W166=0,\"NoChange\",(Z166-$O166)/$O166*100)","v":"NoChange"},null,{"$f":"AC23","v":0},{"$f":"IF(AC166-Z166=0,\"NoChange\",(AC166-$O166)/$O166*100)","v":"NoChange"},null,{"$f":"AF23","v":0},{"$f":"IF(AF166-AC166=0,\"NoChange\",(AF166-$O166)/$O166*100)","v":"NoChange"},null,{"$f":"AI23","v":0},{"$f":"IF(AI166-AF166=0,\"NoChange\",(AI166-$O166)/$O166*100)","v":"NoChange"},null,{"$f":"AL23","v":0},{"$f":"IF(AL166-AI166=0,\"NoChange\",(AL166-$O166)/$O166*100)","v":"NoChange"},null,{"$f":"AO23","v":0},{"$f":"IF(AO166-AL166=0,\"NoChange\",(AO166-$O166)/$O166*100)","v":"NoChange"}]
[]
["Relative ratings compared to highest overall rated Short-List support"]
[]
[null,null,null,null,null,null,null,null,null,null,null,null,null,null,"Max SL",null,{"$f":"Q25","v":"Score"},null,null,{"$f":"T25","v":"Score"},null,null,{"$f":"W25","v":"Score"},null,null,{"$f":"Z25","v":"Score"},null,null,{"$f":"AC25","v":"Score"},null,null,{"$f":"AF25","v":"Score"},null,null,{"$f":"AI25","v":"Score"},null,null,{"$f":"AL25","v":"Score"},null,null,{"$f":"AO25","v":"Score"}]
[null,null,null,null,null,null,null,null,null,null,null,null,null,"MDA","Rating",null,"Rating","% Diff",null,null,null,null,"Rating","% Diff",null,"Rating","% Diff",null,"Rating","% Diff",null,"Rating","% Diff",null,"Rating","% Diff",null,"Rating","% Diff",null,"Rating","% Diff"]
[null,null,null,null,null,null,null,null,null,null,null,null,null,"Electrical",{"$f":"VLOOKUP(N172,ShortListRatings,$O$184,FALSE)","v":0},null,{"$f":"Q36*10","v":0},{"$f":"IF(Q172-O172=0,0,(Q172-$O172)/$O172*100)","v":0},null,{"$f":"T36*10","v":0},{"$f":"IF(T172-R172=0,0,(T172-$O172)/$O172*100)","v":0},null,{"$f":"W36*10","v":0},{"$f":"IF(W172-Q172=0,0,(W172-$O172)/$O172*100)","v":0},null,{"$f":"Z36*10","v":0},{"$f":"IF(Z172-W172=0,0,(Z172-$O172)/$O172*100)","v":0},null,{"$f":"AC36*10","v":0},{"$f":"IF(AC172-Z172=0,0,(AC172-$O172)/$O172*100)","v":0},null,{"$f":"AF36*10","v":0},{"$f":"IF(AF172-AC172=0,0,(AF172-$O172)/$O172*100)","v":0},null,{"$f":"AI36*10","v":0},{"$f":"IF(AI172-AF172=0,0,(AI172-$O172)/$O172*100)","v":0},null,{"$f":"AL36*10","v":0},{"$f":"IF(AL172-AI172=0,0,(AL172-$O172)/$O172*100)","v":0},null,{"$f":"AO36*10","v":0},{"$f":"IF(AO172-AL172=0,0,(AO172-$O172)/$O172*100)","v":0}]
[null,null,null,null,null,null,null,null,null,null,null,null,null,"S&F",0,null,{"$f":"Q52*10","v":0},{"$f":"IF(Q173-O173=0,0,(Q173-$O173)/$O173)","v":0},null,{"$f":"T52*10","v":0},{"$f":"IF(T173-R173=0,0,(T173-$O173)/$O173)","v":0},null,{"$f":"W52*10","v":0},{"$f":"IF(W173-Q173=0,0,(W173-$O173)/$O173*100)","v":0},null,{"$f":"Z52*10","v":0},{"$f":"IF(Z173-W173=0,0,(Z173-$O173)/$O173*100)","v":0},null,{"$f":"AC52*10","v":0},{"$f":"IF(AC173-Z173=0,0,(AC173-$O173)/$O173*100)","v":0},null,{"$f":"AF52*10","v":0},{"$f":"IF(AF173-AC173=0,0,(AF173-$O173)/$O173*100)","v":0},null,{"$f":"AI52*10","v":0},{"$f":"IF(AI173-AF173=0,0,(AI173-$O173)/$O173*100)","v":0},null,{"$f":"AL52*10","v":0},{"$f":"IF(AL173-AI173=0,0,(AL173-$O173)/$O173*100)","v":0},null,{"$f":"AO52*10","v":0},{"$f":"IF(AO173-AL173=0,0,(AO173-$O173)/$O173*100)","v":0}]
[null,null,null,null,null,null,null,null,null,null,null,null,null,"M&E",0,null,{"$f":"Q62*10","v":0},0,null,{"$f":"T62*10","v":0},0,null,{"$f":"W62*10","v":0},0,null,{"$f":"Z62*10","v":0},0,null,{"$f":"AC62*10","v":0},0,null,{"$f":"AF62*10","v":0},0,null,{"$f":"AI62*10","v":0},0,null,{"$f":"AL62*10","v":0},0,null,{"$f":"AO62*10","v":0},0]
[null,null,null,null,null,null,null,null,null,null,null,null,null,"Constr",0,null,{"$f":"Q80*10","v":0},0,null,{"$f":"T80*10","v":0},0,null,{"$f":"W80*10","v":0},0,null,{"$f":"Z80*10","v":0},0,null,{"$f":"AC80*10","v":0},0,null,{"$f":"AF80*10","v":0},0,null,{"$f":"AI80*10","v":0},0,null,{"$f":"AL80*10","v":0},0,null,{"$f":"AO80*10","v":0},0]
[null,null,null,null,null,null,null,null,null,null,null,null,null,"Maint",0,null,{"$f":"Q90*10","v":0},0,null,{"$f":"T90*10","v":0},0,null,{"$f":"W90*10","v":0},0,null,{"$f":"Z90*10","v":0},0,null,{"$f":"AC90*10","v":0},0,null,{"$f":"AF90*10","v":0},0,null,{"$f":"AI90*10","v":0},0,null,{"$f":"AL90*10","v":0},0,null,{"$f":"AO90*10","v":0},0]
[null,null,null,null,null,null,null,null,null,null,null,null,null,"OpSafety",0,null,{"$f":"Q95*10","v":0},0,null,{"$f":"T95*10","v":0},0,null,{"$f":"W95*10","v":0},0,null,{"$f":"Z95*10","v":0},0,null,{"$f":"AC95*10","v":0},0,null,{"$f":"AF95*10","v":0},0,null,{"$f":"AI95*10","v":0},0,null,{"$f":"AL95*10","v":0},0,null,{"$f":"AO95*10","v":0},0]
[null,null,null,null,null,null,null,null,null,null,null,null,null,"Env",0,null,{"$f":"Q108*10","v":0},0,null,{"$f":"T108*10","v":0},0,null,{"$f":"W108*10","v":0},0,null,{"$f":"Z108*10","v":0},0,null,{"$f":"AC108*10","v":0},0,null,{"$f":"AF108*10","v":0},0,null,{"$f":"AI108*10","v":0},0,null,{"$f":"AL108*10","v":0},0,null,{"$f":"AO108*10","v":0},0]
[null,null,null,null,null,null,null,null,null,null,null,null,null,"Other",0,null,{"$f":"Q115*10","v":0},0,null,{"$f":"T115*10","v":0},0,null,{"$f":"W115*10","v":0},0,null,{"$f":"Z115*10","v":0},{"$f":"IF(Z179-W179=0,0,(Z179-$O179)/$O179*100)","v":0},null,{"$f":"AC115*10","v":0},0,null,{"$f":"AF115*10","v":0},0,null,{"$f":"AI115*10","v":0},0,null,{"$f":"AL115*10","v":0},0,null,{"$f":"AO115*10","v":0},0]
[]
[null,null,null,null,null,null,null,null,null,null,null,null,null,"Overall",{"$f":"MAX(Q181,W181,Z181,AC181,AF181,AI181,AL181,AO181)","v":0},null,{"$f":"Q23","v":0},{"$f":"IF(Q181-$O181=0,0,(Q181-$O181)/$O181*100)","v":0},null,{"$f":"T23","v":0},{"$f":"IF(T181-$O181=0,0,(T181-$O181)/$O181*100)","v":0},null,{"$f":"W23","v":0},{"$f":"IF(W181-$O181=0,\"NoChange\",(W181-$O181)/$O181*100)","v":"NoChange"},null,{"$f":"Z23","v":0},{"$f":"IF(Z181-$O181=0,\"NoChange\",(Z181-$O181)/$O181*100)","v":"NoChange"},null,{"$f":"AC23","v":0},{"$f":"IF(AC181-$O181=0,\"NoChange\",(AC181-$O181)/$O181*100)","v":"NoChange"},null,{"$f":"AF23","v":0},{"$f":"IF(AF181-$O181=0,\"NoChange\",(AF181-$O181)/$O181*100)","v":"NoChange"},null,{"$f":"AI23","v":0},{"$f":"IF(AI181-$O181=0,\"NoChange\",(AI181-$O181)/$O181*100)","v":"NoChange"},null,{"$f":"AL23","v":0},{"$f":"IF(AL181-$O181=0,\"NoChange\",(AL181-$O181)/$O181*100)","v":"NoChange"},null,{"$f":"AO23","v":0},{"$f":"IF(AO181-$O181=0,\"NoChange\",(AO181-$O181)/$O181*100)","v":"NoChange"}]
[]
[null,null,null,null,null,null,null,null,null,null,null,null,null,null,"Lookup col"]
[null,null,null,null,null,null,null,null,null,null,null,null,null,null,{"$f":"3+MATCH(O181,Q181:AP181,0)","v":4}]
[null,null,null,null,null,null,null,null,null,null,null,null,null,1,2,4,5,6,null,5,6,7,8,9,10,11,12,13,14,15,16,17,18,19,20,21,22,23,24,25,26,27]

{"sheet":"(3)Ranked List of DAs","index":2,"n_rows":90,"n_cols":7,"rows_kept":90,"cut":false,"hidden":false,"merged":[]}
[]
[null,"RANKING OF DESIGN ASPECTS"]
[]
[null,null,"Design aspect ranking reset"]
[]
[]
[]
[null,"DA ref","Main Design Aspect (MDA)","Design aspect (DA)","MDA weighting","DA weighting","O/A \nweighting"]
[78,{"$f":"'(2)SupportAssessMatrix'!B103","v":"P.8"},{"$f":"'(2)SupportAssessMatrix'!A103","v":"Environmental"},{"$f":"'(2)SupportAssessMatrix'!C103","v":"Design aesthetics"},{"$f":"'(2)SupportAssessMatrix'!G103","v":0.12},{"$f":"'(2)SupportAssessMatrix'!J103","v":8.3333333333333329E-2},{"$f":"'(2)SupportAssessMatrix'!L103","v":9.9999999999999985E-3}]
[79,{"$f":"'(2)SupportAssessMatrix'!B104","v":"P.9"},{"$f":"'(2)SupportAssessMatrix'!A104","v":"Environmental"},{"$f":"'(2)SupportAssessMatrix'!C104","v":"Corridor Width"},{"$f":"'(2)SupportAssessMatrix'!G104","v":0.12},{"$f":"'(2)SupportAssessMatrix'!J104","v":8.3333333333333329E-2},{"$f":"'(2)SupportAssessMatrix'!L104","v":9.9999999999999985E-3}]
[80,{"$f":"'(2)SupportAssessMatrix'!B105","v":"P.10"},{"$f":"'(2)SupportAssessMatrix'!A105","v":"Environmental"},{"$f":"'(2)SupportAssessMatrix'!C105","v":"As Built Footprint"},{"$f":"'(2)SupportAssessMatrix'!G105","v":0.12},{"$f":"'(2)SupportAssessMatrix'!J105","v":8.3333333333333329E-2},{"$f":"'(2)SupportAssessMatrix'!L105","v":9.9999999999999985E-3}]
[66,{"$f":"'(2)SupportAssessMatrix'!B91","v":"O.1"},{"$f":"'(2)SupportAssessMatrix'!A91","v":"Operational Safety"},{"$f":"'(2)SupportAssessMatrix'!C91","v":"Access/ Egress/ Rescue"},{"$f":"'(2)SupportAssessMatrix'!G91","v":0.12},{"$f":"'(2)SupportAssessMatrix'!J91","v":0.25},{"$f":"'(2)SupportAssessMatrix'!L91","v":0.03}]
[15,{"$f":"'(2)SupportAssessMatrix'!B40","v":"S.4"},{"$f":"'(2)SupportAssessMatrix'!A40","v":"Supports & Foundations"},{"$f":"'(2)SupportAssessMatrix'!C40","v":"Weight of structure (per km)"},{"$f":"'(2)SupportAssessMatrix'!G40","v":0.13},{"$f":"'(2)SupportAssessMatrix'!J40","v":6.6666666666666666E-2},{"$f":"'(2)SupportAssessMatrix'!L40","v":8.6666666666666663E-3}]
[12,{"$f":"'(2)SupportAssessMatrix'!B37","v":"S.1"},{"$f":"'(2)SupportAssessMatrix'!A37","v":"Supports & Foundations"},{"$f":"'(2)SupportAssessMatrix'!C37","v":"Number of elements"},{"$f":"'(2)SupportAssessMatrix'!G37","v":0.13},{"$f":"'(2)SupportAssessMatrix'!J37","v":6.6666666666666666E-2},{"$f":"'(2)SupportAssessMatrix'!L37","v":8.6666666666666663E-3}]
[13,{"$f":"'(2)SupportAssessMatrix'!B38","v":"S.2"},{"$f":"'(2)SupportAssessMatrix'!A38","v":"Supports & Foundations"},{"$f":"'(2)SupportAssessMatrix'!C38","v":"Number of joints"},{"$f":"'(2)SupportAssessMatrix'!G38","v":0.13},{"$f":"'(2)SupportAssessMatrix'!J38","v":6.6666666666666666E-2},{"$f":"'(2)SupportAssessMatrix'!L38","v":8.6666666666666663E-3}]
[22,{"$f":"'(2)SupportAssessMatrix'!B47","v":"S.11"},{"$f":"'(2)SupportAssessMatrix'!A47","v":"Supports & Foundations"},{"$f":"'(2)SupportAssessMatrix'!C47","v":"Familiarity with Form (familiar forms score high)"},{"$f":"'(2)SupportAssessMatrix'!G47","v":0.13},{"$f":"'(2)SupportAssessMatrix'!J47","v":6.6666666666666666E-2},{"$f":"'(2)SupportAssessMatrix'!L47","v":8.6666666666666663E-3}]
[24,{"$f":"'(2)SupportAssessMatrix'!B49","v":"S.13"},{"$f":"'(2)SupportAssessMatrix'!A49","v":"Supports & Foundations"},{"$f":"'(2)SupportAssessMatrix'!C49","v":"Foundations (Volume of concrete per km)"},{"$f":"'(2)SupportAssessMatrix'!G49","v":0.13},{"$f":"'(2)SupportAssessMatrix'!J49","v":6.6666666666666666E-2},{"$f":"'(2)SupportAssessMatrix'!L49","v":8.6666666666666663E-3}]
[81,{"$f":"'(2)SupportAssessMatrix'!B106","v":"P.11"},{"$f":"'(2)SupportAssessMatrix'!A106","v":"Environmental"},{"$f":"'(2)SupportAssessMatrix'!C106","v":"Effect on Birds"},{"$f":"'(2)SupportAssessMatrix'!G106","v":0.12},{"$f":"'(2)SupportAssessMatrix'!J106","v":8.3333333333333329E-2},{"$f":"'(2)SupportAssessMatrix'!L106","v":9.9999999999999985E-3}]
[30,{"$f":"'(2)SupportAssessMatrix'!B55","v":"M.3"},{"$f":"'(2)SupportAssessMatrix'!A55","v":"Mechanical & Electrical"},{"$f":"'(2)SupportAssessMatrix'!C55","v":"Number of Insulators"},{"$f":"'(2)SupportAssessMatrix'!G55","v":0.13},{"$f":"'(2)SupportAssessMatrix'!J55","v":0.1111111111111111},{"$f":"'(2)SupportAssessMatrix'!L55","v":1.4444444444444444E-2}]
[31,{"$f":"'(2)SupportAssessMatrix'!B56","v":"M.4"},{"$f":"'(2)SupportAssessMatrix'!A56","v":"Mechanical & Electrical"},{"$f":"'(2)SupportAssessMatrix'!C56","v":"Galloping (susceptibility to conductor clashing)"},{"$f":"'(2)SupportAssessMatrix'!G56","v":0.13},{"$f":"'(2)SupportAssessMatrix'!J56","v":0.1111111111111111},{"$f":"'(2)SupportAssessMatrix'!L56","v":1.4444444444444444E-2}]
[33,{"$f":"'(2)SupportAssessMatrix'!B58","v":"M.6"},{"$f":"'(2)SupportAssessMatrix'!A58","v":"Mechanical & Electrical"},{"$f":"'(2)SupportAssessMatrix'!C58","v":"Angle Support Insulation"},{"$f":"'(2)SupportAssessMatrix'!G58","v":0.13},{"$f":"'(2)SupportAssessMatrix'!J58","v":0.1111111111111111},{"$f":"'(2)SupportAssessMatrix'!L58","v":1.4444444444444444E-2}]
[16,{"$f":"'(2)SupportAssessMatrix'!B41","v":"S.5"},{"$f":"'(2)SupportAssessMatrix'!A41","v":"Supports & Foundations"},{"$f":"'(2)SupportAssessMatrix'!C41","v":"Suitability to use of alternative materials"},{"$f":"'(2)SupportAssessMatrix'!G41","v":0.13},{"$f":"'(2)SupportAssessMatrix'!J41","v":6.6666666666666666E-2},{"$f":"'(2)SupportAssessMatrix'!L41","v":8.6666666666666663E-3}]
[72,{"$f":"'(2)SupportAssessMatrix'!B97","v":"P.2"},{"$f":"'(2)SupportAssessMatrix'!A97","v":"Environmental"},{"$f":"'(2)SupportAssessMatrix'!C97","v":"Supports per km"},{"$f":"'(2)SupportAssessMatrix'!G97","v":0.12},{"$f":"'(2)SupportAssessMatrix'!J97","v":8.3333333333333329E-2},{"$f":"'(2)SupportAssessMatrix'!L97","v":9.9999999999999985E-3}]
[82,{"$f":"'(2)SupportAssessMatrix'!B107","v":"P.12"},{"$f":"'(2)SupportAssessMatrix'!A107","v":"Environmental"},{"$f":"'(2)SupportAssessMatrix'!C107","v":"Tension Support Continuity"},{"$f":"'(2)SupportAssessMatrix'!G107","v":0.12},{"$f":"'(2)SupportAssessMatrix'!J107","v":8.3333333333333329E-2},{"$f":"'(2)SupportAssessMatrix'!L107","v":9.9999999999999985E-3}]
[67,{"$f":"'(2)SupportAssessMatrix'!B92","v":"O.2"},{"$f":"'(2)SupportAssessMatrix'!A92","v":"Operational Safety"},{"$f":"'(2)SupportAssessMatrix'!C92","v":"Live line working"},{"$f":"'(2)SupportAssessMatrix'!G92","v":0.12},{"$f":"'(2)SupportAssessMatrix'!J92","v":0.25},{"$f":"'(2)SupportAssessMatrix'!L92","v":0.03}]
[68,{"$f":"'(2)SupportAssessMatrix'!B93","v":"O.3"},{"$f":"'(2)SupportAssessMatrix'!A93","v":"Operational Safety"},{"$f":"'(2)SupportAssessMatrix'!C93","v":"Management of Induced voltages / currents / Application of additional earthing"},{"$f":"'(2)SupportAssessMatrix'!G93","v":0.12},{"$f":"'(2)SupportAssessMatrix'!J93","v":0.25},{"$f":"'(2)SupportAssessMatrix'!L93","v":0.03}]
[14,{"$f":"'(2)SupportAssessMatrix'!B39","v":"S.3"},{"$f":"'(2)SupportAssessMatrix'!A39","v":"Supports & Foundations"},{"$f":"'(2)SupportAssessMatrix'!C39","v":"Side slope added complexity"},{"$f":"'(2)SupportAssessMatrix'!G39","v":0.13},{"$f":"'(2)SupportAssessMatrix'!J39","v":6.6666666666666666E-2},{"$f":"'(2)SupportAssessMatrix'!L39","v":8.6666666666666663E-3}]
[25,{"$f":"'(2)SupportAssessMatrix'!B50","v":"S.14"},{"$f":"'(2)SupportAssessMatrix'!A50","v":"Supports & Foundations"},{"$f":"'(2)SupportAssessMatrix'!C50","v":"Foundations (Volume of excavation per km)"},{"$f":"'(2)SupportAssessMatrix'!G50","v":0.13},{"$f":"'(2)SupportAssessMatrix'!J50","v":6.6666666666666666E-2},{"$f":"'(2)SupportAssessMatrix'!L50","v":8.6666666666666663E-3}]
[1,{"$f":"'(2)SupportAssessMatrix'!B26","v":"E.1"},{"$f":"'(2)SupportAssessMatrix'!A26","v":"Electrical"},{"$f":"'(2)SupportAssessMatrix'!C26","v":"Audible Noise"},{"$f":"'(2)SupportAssessMatrix'!G26","v":0.13},{"$f":"'(2)SupportAssessMatrix'!J26","v":0.1},{"$f":"'(2)SupportAssessMatrix'!L26","v":1.3000000000000001E-2}]
[74,{"$f":"'(2)SupportAssessMatrix'!B99","v":"P.4"},{"$f":"'(2)SupportAssessMatrix'!A99","v":"Environmental"},{"$f":"'(2)SupportAssessMatrix'!C99","v":"Transparency (Back clothing)"},{"$f":"'(2)SupportAssessMatrix'!G99","v":0.12},{"$f":"'(2)SupportAssessMatrix'!J99","v":8.3333333333333329E-2},{"$f":"'(2)SupportAssessMatrix'!L99","v":9.9999999999999985E-3}]
[76,{"$f":"'(2)SupportAssessMatrix'!B101","v":"P.6"},{"$f":"'(2)SupportAssessMatrix'!A101","v":"Environmental"},{"$f":"'(2)SupportAssessMatrix'!C101","v":"Support  shape (eiffelised/ top heavy etc.)"},{"$f":"'(2)SupportAssessMatrix'!G101","v":0.12},{"$f":"'(2)SupportAssessMatrix'!J101","v":8.3333333333333329E-2},{"$f":"'(2)SupportAssessMatrix'!L101","v":9.9999999999999985E-3}]
[77,{"$f":"'(2)SupportAssessMatrix'!B102","v":"P.7"},{"$f":"'(2)SupportAssessMatrix'!A102","v":"Environmental"},{"$f":"'(2)SupportAssessMatrix'!C102","v":"Cross arms"},{"$f":"'(2)SupportAssessMatrix'!G102","v":0.12},{"$f":"'(2)SupportAssessMatrix'!J102","v":8.3333333333333329E-2},{"$f":"'(2)SupportAssessMatrix'!L102","v":9.9999999999999985E-3}]
[23,{"$f":"'(2)SupportAssessMatrix'!B48","v":"S.12"},{"$f":"'(2)SupportAssessMatrix'!A48","v":"Supports & Foundations"},{"$f":"'(2)SupportAssessMatrix'!C48","v":"Foundation complexity"},{"$f":"'(2)SupportAssessMatrix'!G48","v":0.13},{"$f":"'(2)SupportAssessMatrix'!J48","v":6.6666666666666666E-2},{"$f":"'(2)SupportAssessMatrix'!L48","v":8.6666666666666663E-3}]
[69,{"$f":"'(2)SupportAssessMatrix'!B94","v":"O.4"},{"$f":"'(2)SupportAssessMatrix'!A94","v":"Operational Safety"},{"$f":"'(2)SupportAssessMatrix'!C94","v":"Circuit Demarcation"},{"$f":"'(2)SupportAssessMatrix'!G94","v":0.12},{"$f":"'(2)SupportAssessMatrix'!J94","v":0.25},{"$f":"'(2)SupportAssessMatrix'!L94","v":0.03}]
[57,{"$f":"'(2)SupportAssessMatrix'!B82","v":"R.2"},{"$f":"'(2)SupportAssessMatrix'!A82","v":"Maintenance"},{"$f":"'(2)SupportAssessMatrix'!C82","v":"Main Component Replacement"},{"$f":"'(2)SupportAssessMatrix'!G82","v":0.12},{"$f":"'(2)SupportAssessMatrix'!J82","v":0.1111111111111111},{"$f":"'(2)SupportAssessMatrix'!L82","v":1.3333333333333332E-2}]
[71,{"$f":"'(2)SupportAssessMatrix'!B96","v":"P.1"},{"$f":"'(2)SupportAssessMatrix'!A96","v":"Environmental"},{"$f":"'(2)SupportAssessMatrix'!C96","v":"Height"},{"$f":"'(2)SupportAssessMatrix'!G96","v":0.12},{"$f":"'(2)SupportAssessMatrix'!J96","v":8.3333333333333329E-2},{"$f":"'(2)SupportAssessMatrix'!L96","v":9.9999999999999985E-3}]
[73,{"$f":"'(2)SupportAssessMatrix'!B98","v":"P.3"},{"$f":"'(2)SupportAssessMatrix'!A98","v":"Environmental"},{"$f":"'(2)SupportAssessMatrix'!C98","v":"Insulator Visual Impact"},{"$f":"'(2)SupportAssessMatrix'!G98","v":0.12},{"$f":"'(2)SupportAssessMatrix'!J98","v":8.3333333333333329E-2},{"$f":"'(2)SupportAssessMatrix'!L98","v":9.9999999999999985E-3}]
[75,{"$f":"'(2)SupportAssessMatrix'!B100","v":"P.5"},{"$f":"'(2)SupportAssessMatrix'!A100","v":"Environmental"},{"$f":"'(2)SupportAssessMatrix'!C100","v":"Conductor Arrangement (Compact/ Open)"},{"$f":"'(2)SupportAssessMatrix'!G100","v":0.12},{"$f":"'(2)SupportAssessMatrix'!J100","v":8.3333333333333329E-2},{"$f":"'(2)SupportAssessMatrix'!L100","v":9.9999999999999985E-3}]
[48,{"$f":"'(2)SupportAssessMatrix'!B73","v":"C.11"},{"$f":"'(2)SupportAssessMatrix'!A73","v":"Construction "},{"$f":"'(2)SupportAssessMatrix'!C73","v":"Support access/ egress/ rescue"},{"$f":"'(2)SupportAssessMatrix'!G73","v":0.13},{"$f":"'(2)SupportAssessMatrix'!J73","v":5.8823529411764705E-2},{"$f":"'(2)SupportAssessMatrix'!L73","v":7.6470588235294122E-3}]
[45,{"$f":"'(2)SupportAssessMatrix'!B70","v":"C.8"},{"$f":"'(2)SupportAssessMatrix'!A70","v":"Construction "},{"$f":"'(2)SupportAssessMatrix'!C70","v":"Support Transport & Storage"},{"$f":"'(2)SupportAssessMatrix'!G70","v":0.13},{"$f":"'(2)SupportAssessMatrix'!J70","v":5.8823529411764705E-2},{"$f":"'(2)SupportAssessMatrix'!L70","v":7.6470588235294122E-3}]
[44,{"$f":"'(2)SupportAssessMatrix'!B69","v":"C.7"},{"$f":"'(2)SupportAssessMatrix'!A69","v":"Construction "},{"$f":"'(2)SupportAssessMatrix'!C69","v":"Area required for Assembly & Erection"},{"$f":"'(2)SupportAssessMatrix'!G69","v":0.13},{"$f":"'(2)SupportAssessMatrix'!J69","v":5.8823529411764705E-2},{"$f":"'(2)SupportAssessMatrix'!L69","v":7.6470588235294122E-3}]
[47,{"$f":"'(2)SupportAssessMatrix'!B72","v":"C.10"},{"$f":"'(2)SupportAssessMatrix'!A72","v":"Construction "},{"$f":"'(2)SupportAssessMatrix'!C72","v":"Ease of support assembly / erection"},{"$f":"'(2)SupportAssessMatrix'!G72","v":0.13},{"$f":"'(2)SupportAssessMatrix'!J72","v":5.8823529411764705E-2},{"$f":"'(2)SupportAssessMatrix'!L72","v":7.6470588235294122E-3}]
[17,{"$f":"'(2)SupportAssessMatrix'!B42","v":"S.6"},{"$f":"'(2)SupportAssessMatrix'!A42","v":"Supports & Foundations"},{"$f":"'(2)SupportAssessMatrix'!C42","v":"Reduction in reliability in single circuit configuration (i.e. strung one side)"},{"$f":"'(2)SupportAssessMatrix'!G42","v":0.13},{"$f":"'(2)SupportAssessMatrix'!J42","v":6.6666666666666666E-2},{"$f":"'(2)SupportAssessMatrix'!L42","v":8.6666666666666663E-3}]
[19,{"$f":"'(2)SupportAssessMatrix'!B44","v":"S.8"},{"$f":"'(2)SupportAssessMatrix'!A44","v":"Supports & Foundations"},{"$f":"'(2)SupportAssessMatrix'!C44","v":"Area for painting"},{"$f":"'(2)SupportAssessMatrix'!G44","v":0.13},{"$f":"'(2)SupportAssessMatrix'!J44","v":6.6666666666666666E-2},{"$f":"'(2)SupportAssessMatrix'!L44","v":8.6666666666666663E-3}]
[54,{"$f":"'(2)SupportAssessMatrix'!B79","v":"C.17"},{"$f":"'(2)SupportAssessMatrix'!A79","v":"Construction "},{"$f":"'(2)SupportAssessMatrix'!C79","v":"Tension Support (Conductor Installation)"},{"$f":"'(2)SupportAssessMatrix'!G79","v":0.13},{"$f":"'(2)SupportAssessMatrix'!J79","v":5.8823529411764705E-2},{"$f":"'(2)SupportAssessMatrix'!L79","v":7.6470588235294122E-3}]
[2,{"$f":"'(2)SupportAssessMatrix'!B27","v":"E.2"},{"$f":"'(2)SupportAssessMatrix'!A27","v":"Electrical"},{"$f":"'(2)SupportAssessMatrix'!C27","v":"Magnetic Fields (external)"},{"$f":"'(2)SupportAssessMatrix'!G27","v":0.13},{"$f":"'(2)SupportAssessMatrix'!J27","v":0.1},{"$f":"'(2)SupportAssessMatrix'!L27","v":1.3000000000000001E-2}]
[3,{"$f":"'(2)SupportAssessMatrix'!B28","v":"E.3"},{"$f":"'(2)SupportAssessMatrix'!A28","v":"Electrical"},{"$f":"'(2)SupportAssessMatrix'!C28","v":"Electric Fields (external)"},{"$f":"'(2)SupportAssessMatrix'!G28","v":0.13},{"$f":"'(2)SupportAssessMatrix'!J28","v":0.1},{"$f":"'(2)SupportAssessMatrix'!L28","v":1.3000000000000001E-2}]
[4,{"$f":"'(2)SupportAssessMatrix'!B29","v":"E.4"},{"$f":"'(2)SupportAssessMatrix'!A29","v":"Electrical"},{"$f":"'(2)SupportAssessMatrix'!C29","v":"Radio Interference"},{"$f":"'(2)SupportAssessMatrix'!G29","v":0.13},{"$f":"'(2)SupportAssessMatrix'!J29","v":0.1},{"$f":"'(2)SupportAssessMatrix'!L29","v":1.3000000000000001E-2}]
[60,{"$f":"'(2)SupportAssessMatrix'!B85","v":"R.5"},{"$f":"'(2)SupportAssessMatrix'!A85","v":"Maintenance"},{"$f":"'(2)SupportAssessMatrix'!C85","v":"Phase Conductor System Repairs - 1 cct live proximity"},{"$f":"'(2)SupportAssessMatrix'!G85","v":0.12},{"$f":"'(2)SupportAssessMatrix'!J85","v":0.1111111111111111},{"$f":"'(2)SupportAssessMatrix'!L85","v":1.3333333333333332E-2}]
[61,{"$f":"'(2)SupportAssessMatrix'!B86","v":"R.6"},{"$f":"'(2)SupportAssessMatrix'!A86","v":"Maintenance"},{"$f":"'(2)SupportAssessMatrix'!C86","v":"Earthwire Conductor System Repairs - 1cct live proximity"},{"$f":"'(2)SupportAssessMatrix'!G86","v":0.12},{"$f":"'(2)SupportAssessMatrix'!J86","v":0.1111111111111111},{"$f":"'(2)SupportAssessMatrix'!L86","v":1.3333333333333332E-2}]
[63,{"$f":"'(2)SupportAssessMatrix'!B88","v":"R.8"},{"$f":"'(2)SupportAssessMatrix'!A88","v":"Maintenance"},{"$f":"'(2)SupportAssessMatrix'!C88","v":"Condition Assessment Remote (Ground/ Aerial)"},{"$f":"'(2)SupportAssessMatrix'!G88","v":0.12},{"$f":"'(2)SupportAssessMatrix'!J88","v":0.1111111111111111},{"$f":"'(2)SupportAssessMatrix'!L88","v":1.3333333333333332E-2}]
[42,{"$f":"'(2)SupportAssessMatrix'!B67","v":"C.5"},{"$f":"'(2)SupportAssessMatrix'!A67","v":"Construction "},{"$f":"'(2)SupportAssessMatrix'!C67","v":"Complexity of support (Fabrication)"},{"$f":"'(2)SupportAssessMatrix'!G67","v":0.13},{"$f":"'(2)SupportAssessMatrix'!J67","v":5.8823529411764705E-2},{"$f":"'(2)SupportAssessMatrix'!L67","v":7.6470588235294122E-3}]
[7,{"$f":"'(2)SupportAssessMatrix'!B32","v":"E.7"},{"$f":"'(2)SupportAssessMatrix'!A32","v":"Electrical"},{"$f":"'(2)SupportAssessMatrix'!C32","v":"Insulation Coordination"},{"$f":"'(2)SupportAssessMatrix'!G32","v":0.13},{"$f":"'(2)SupportAssessMatrix'!J32","v":0.1},{"$f":"'(2)SupportAssessMatrix'!L32","v":1.3000000000000001E-2}]
[50,{"$f":"'(2)SupportAssessMatrix'!B75","v":"C.13"},{"$f":"'(2)SupportAssessMatrix'!A75","v":"Construction "},{"$f":"'(2)SupportAssessMatrix'!C75","v":"Conductor Installation Process"},{"$f":"'(2)SupportAssessMatrix'!G75","v":0.13},{"$f":"'(2)SupportAssessMatrix'!J75","v":5.8823529411764705E-2},{"$f":"'(2)SupportAssessMatrix'!L75","v":7.6470588235294122E-3}]
[52,{"$f":"'(2)SupportAssessMatrix'!B77","v":"C.15"},{"$f":"'(2)SupportAssessMatrix'!A77","v":"Construction "},{"$f":"'(2)SupportAssessMatrix'!C77","v":"Refurbishment inc. e/w- 1 cct live proximity"},{"$f":"'(2)SupportAssessMatrix'!G77","v":0.13},{"$f":"'(2)SupportAssessMatrix'!J77","v":5.8823529411764705E-2},{"$f":"'(2)SupportAssessMatrix'!L77","v":7.6470588235294122E-3}]
[53,{"$f":"'(2)SupportAssessMatrix'!B78","v":"C.16"},{"$f":"'(2)SupportAssessMatrix'!A78","v":"Construction "},{"$f":"'(2)SupportAssessMatrix'!C78","v":"Route Dismantling"},{"$f":"'(2)SupportAssessMatrix'!G78","v":0.13},{"$f":"'(2)SupportAssessMatrix'!J78","v":5.8823529411764705E-2},{"$f":"'(2)SupportAssessMatrix'!L78","v":7.6470588235294122E-3}]
[28,{"$f":"'(2)SupportAssessMatrix'!B53","v":"M.1"},{"$f":"'(2)SupportAssessMatrix'!A53","v":"Mechanical & Electrical"},{"$f":"'(2)SupportAssessMatrix'!C53","v":"Insulation Mechanical Reliability"},{"$f":"'(2)SupportAssessMatrix'!G53","v":0.13},{"$f":"'(2)SupportAssessMatrix'!J53","v":0.1111111111111111},{"$f":"'(2)SupportAssessMatrix'!L53","v":1.4444444444444444E-2}]
[29,{"$f":"'(2)SupportAssessMatrix'!B54","v":"M.2"},{"$f":"'(2)SupportAssessMatrix'!A54","v":"Mechanical & Electrical"},{"$f":"'(2)SupportAssessMatrix'!C54","v":"Insulation Material Limitation"},{"$f":"'(2)SupportAssessMatrix'!G54","v":0.13},{"$f":"'(2)SupportAssessMatrix'!J54","v":0.1111111111111111},{"$f":"'(2)SupportAssessMatrix'!L54","v":1.4444444444444444E-2}]
[32,{"$f":"'(2)SupportAssessMatrix'!B57","v":"M.5"},{"$f":"'(2)SupportAssessMatrix'!A57","v":"Mechanical & Electrical"},{"$f":"'(2)SupportAssessMatrix'!C57","v":"Formation of Jumpers at Angle Supports"},{"$f":"'(2)SupportAssessMatrix'!G57","v":0.13},{"$f":"'(2)SupportAssessMatrix'!J57","v":0.1111111111111111},{"$f":"'(2)SupportAssessMatrix'!L57","v":1.4444444444444444E-2}]
[62,{"$f":"'(2)SupportAssessMatrix'!B87","v":"R.7"},{"$f":"'(2)SupportAssessMatrix'!A87","v":"Maintenance"},{"$f":"'(2)SupportAssessMatrix'!C87","v":"Surface Preparation & Treatment/ Deterioration Protection"},{"$f":"'(2)SupportAssessMatrix'!G87","v":0.12},{"$f":"'(2)SupportAssessMatrix'!J87","v":0.1111111111111111},{"$f":"'(2)SupportAssessMatrix'!L87","v":1.3333333333333332E-2}]
[18,{"$f":"'(2)SupportAssessMatrix'!B43","v":"S.7"},{"$f":"'(2)SupportAssessMatrix'!A43","v":"Supports & Foundations"},{"$f":"'(2)SupportAssessMatrix'!C43","v":"Ice accretion performance"},{"$f":"'(2)SupportAssessMatrix'!G43","v":0.13},{"$f":"'(2)SupportAssessMatrix'!J43","v":6.6666666666666666E-2},{"$f":"'(2)SupportAssessMatrix'!L43","v":8.6666666666666663E-3}]
[20,{"$f":"'(2)SupportAssessMatrix'!B45","v":"S.9"},{"$f":"'(2)SupportAssessMatrix'!A45","v":"Supports & Foundations"},{"$f":"'(2)SupportAssessMatrix'!C45","v":"Implications of addition of extensions"},{"$f":"'(2)SupportAssessMatrix'!G45","v":0.13},{"$f":"'(2)SupportAssessMatrix'!J45","v":6.6666666666666666E-2},{"$f":"'(2)SupportAssessMatrix'!L45","v":8.6666666666666663E-3}]
[21,{"$f":"'(2)SupportAssessMatrix'!B46","v":"S.10"},{"$f":"'(2)SupportAssessMatrix'!A46","v":"Supports & Foundations"},{"$f":"'(2)SupportAssessMatrix'!C46","v":"Length of load path"},{"$f":"'(2)SupportAssessMatrix'!G46","v":0.13},{"$f":"'(2)SupportAssessMatrix'!J46","v":6.6666666666666666E-2},{"$f":"'(2)SupportAssessMatrix'!L46","v":8.6666666666666663E-3}]
[26,{"$f":"'(2)SupportAssessMatrix'!B51","v":"S.15"},{"$f":"'(2)SupportAssessMatrix'!A51","v":"Supports & Foundations"},{"$f":"'(2)SupportAssessMatrix'!C51","v":"Suitability for application of two earthwires"},{"$f":"'(2)SupportAssessMatrix'!G51","v":0.13},{"$f":"'(2)SupportAssessMatrix'!J51","v":6.6666666666666666E-2},{"$f":"'(2)SupportAssessMatrix'!L51","v":8.6666666666666663E-3}]
[58,{"$f":"'(2)SupportAssessMatrix'!B83","v":"R.3"},{"$f":"'(2)SupportAssessMatrix'!A83","v":"Maintenance"},{"$f":"'(2)SupportAssessMatrix'!C83","v":"Suitability for operational activities (e.g. isolation)"},{"$f":"'(2)SupportAssessMatrix'!G83","v":0.12},{"$f":"'(2)SupportAssessMatrix'!J83","v":0.1111111111111111},{"$f":"'(2)SupportAssessMatrix'!L83","v":1.3333333333333332E-2}]
[59,{"$f":"'(2)SupportAssessMatrix'!B84","v":"R.4"},{"$f":"'(2)SupportAssessMatrix'!A84","v":"Maintenance"},{"$f":"'(2)SupportAssessMatrix'!C84","v":"Main Component Replacement to Earthwires"},{"$f":"'(2)SupportAssessMatrix'!G84","v":0.12},{"$f":"'(2)SupportAssessMatrix'!J84","v":0.1111111111111111},{"$f":"'(2)SupportAssessMatrix'!L84","v":1.3333333333333332E-2}]
[43,{"$f":"'(2)SupportAssessMatrix'!B68","v":"C.6"},{"$f":"'(2)SupportAssessMatrix'!A68","v":"Construction "},{"$f":"'(2)SupportAssessMatrix'!C68","v":"Area required for Foundation Construction"},{"$f":"'(2)SupportAssessMatrix'!G68","v":0.13},{"$f":"'(2)SupportAssessMatrix'!J68","v":5.8823529411764705E-2},{"$f":"'(2)SupportAssessMatrix'!L68","v":7.6470588235294122E-3}]
[40,{"$f":"'(2)SupportAssessMatrix'!B65","v":"C.3"},{"$f":"'(2)SupportAssessMatrix'!A65","v":"Construction "},{"$f":"'(2)SupportAssessMatrix'!C65","v":"Support Type testing"},{"$f":"'(2)SupportAssessMatrix'!G65","v":0.13},{"$f":"'(2)SupportAssessMatrix'!J65","v":5.8823529411764705E-2},{"$f":"'(2)SupportAssessMatrix'!L65","v":7.6470588235294122E-3}]
[41,{"$f":"'(2)SupportAssessMatrix'!B66","v":"C.4"},{"$f":"'(2)SupportAssessMatrix'!A66","v":"Construction "},{"$f":"'(2)SupportAssessMatrix'!C66","v":"Support check erect"},{"$f":"'(2)SupportAssessMatrix'!G66","v":0.13},{"$f":"'(2)SupportAssessMatrix'!J66","v":5.8823529411764705E-2},{"$f":"'(2)SupportAssessMatrix'!L66","v":7.6470588235294122E-3}]
[34,{"$f":"'(2)SupportAssessMatrix'!B59","v":"M.7"},{"$f":"'(2)SupportAssessMatrix'!A59","v":"Mechanical & Electrical"},{"$f":"'(2)SupportAssessMatrix'!C59","v":"Type Testing Requirements"},{"$f":"'(2)SupportAssessMatrix'!G59","v":0.13},{"$f":"'(2)SupportAssessMatrix'!J59","v":0.1111111111111111},{"$f":"'(2)SupportAssessMatrix'!L59","v":1.4444444444444444E-2}]
[35,{"$f":"'(2)SupportAssessMatrix'!B60","v":"M.8"},{"$f":"'(2)SupportAssessMatrix'!A60","v":"Mechanical & Electrical"},{"$f":"'(2)SupportAssessMatrix'!C60","v":"Suitability for ICA adaption"},{"$f":"'(2)SupportAssessMatrix'!G60","v":0.13},{"$f":"'(2)SupportAssessMatrix'!J60","v":0.1111111111111111},{"$f":"'(2)SupportAssessMatrix'!L60","v":1.4444444444444444E-2}]
[49,{"$f":"'(2)SupportAssessMatrix'!B74","v":"C.12"},{"$f":"'(2)SupportAssessMatrix'!A74","v":"Construction "},{"$f":"'(2)SupportAssessMatrix'!C74","v":"Need for insulator temporary restraint"},{"$f":"'(2)SupportAssessMatrix'!G74","v":0.13},{"$f":"'(2)SupportAssessMatrix'!J74","v":5.8823529411764705E-2},{"$f":"'(2)SupportAssessMatrix'!L74","v":7.6470588235294122E-3}]
[56,{"$f":"'(2)SupportAssessMatrix'!B81","v":"R.1"},{"$f":"'(2)SupportAssessMatrix'!A81","v":"Maintenance"},{"$f":"'(2)SupportAssessMatrix'!C81","v":"Ancillary equipment (including third party)"},{"$f":"'(2)SupportAssessMatrix'!G81","v":0.12},{"$f":"'(2)SupportAssessMatrix'!J81","v":0.1111111111111111},{"$f":"'(2)SupportAssessMatrix'!L81","v":1.3333333333333332E-2}]
[64,{"$f":"'(2)SupportAssessMatrix'!B89","v":"R.9"},{"$f":"'(2)SupportAssessMatrix'!A89","v":"Maintenance"},{"$f":"'(2)SupportAssessMatrix'!C89","v":"Condition Assessment Intrusive (Climbing)"},{"$f":"'(2)SupportAssessMatrix'!G89","v":0.12},{"$f":"'(2)SupportAssessMatrix'!J89","v":0.1111111111111111},{"$f":"'(2)SupportAssessMatrix'!L89","v":1.3333333333333332E-2}]
[38,{"$f":"'(2)SupportAssessMatrix'!B63","v":"C.1"},{"$f":"'(2)SupportAssessMatrix'!A63","v":"Construction "},{"$f":"'(2)SupportAssessMatrix'!C63","v":"Support Supply Chain Familiarity"},{"$f":"'(2)SupportAssessMatrix'!G63","v":0.13},{"$f":"'(2)SupportAssessMatrix'!J63","v":5.8823529411764705E-2},{"$f":"'(2)SupportAssessMatrix'!L63","v":7.6470588235294122E-3}]
[39,{"$f":"'(2)SupportAssessMatrix'!B64","v":"C.2"},{"$f":"'(2)SupportAssessMatrix'!A64","v":"Construction "},{"$f":"'(2)SupportAssessMatrix'!C64","v":"Insulation Supply Chain Familiarity (Composite)"},{"$f":"'(2)SupportAssessMatrix'!G64","v":0.13},{"$f":"'(2)SupportAssessMatrix'!J64","v":5.8823529411764705E-2},{"$f":"'(2)SupportAssessMatrix'!L64","v":7.6470588235294122E-3}]
[51,{"$f":"'(2)SupportAssessMatrix'!B76","v":"C.14"},{"$f":"'(2)SupportAssessMatrix'!A76","v":"Construction "},{"$f":"'(2)SupportAssessMatrix'!C76","v":"Insulator Conductor Attachment Point"},{"$f":"'(2)SupportAssessMatrix'!G76","v":0.13},{"$f":"'(2)SupportAssessMatrix'!J76","v":5.8823529411764705E-2},{"$f":"'(2)SupportAssessMatrix'!L76","v":7.6470588235294122E-3}]
[9,{"$f":"'(2)SupportAssessMatrix'!B34","v":"E.9"},{"$f":"'(2)SupportAssessMatrix'!A34","v":"Electrical"},{"$f":"'(2)SupportAssessMatrix'!C34","v":"Electric Fields within/near structure"},{"$f":"'(2)SupportAssessMatrix'!G34","v":0.13},{"$f":"'(2)SupportAssessMatrix'!J34","v":0.1},{"$f":"'(2)SupportAssessMatrix'!L34","v":1.3000000000000001E-2}]
[10,{"$f":"'(2)SupportAssessMatrix'!B35","v":"E.10"},{"$f":"'(2)SupportAssessMatrix'!A35","v":"Electrical"},{"$f":"'(2)SupportAssessMatrix'!C35","v":"Magnetic Fields within/ near structure"},{"$f":"'(2)SupportAssessMatrix'!G35","v":0.13},{"$f":"'(2)SupportAssessMatrix'!J35","v":0.1},{"$f":"'(2)SupportAssessMatrix'!L35","v":1.3000000000000001E-2}]
[46,{"$f":"'(2)SupportAssessMatrix'!B71","v":"C.9"},{"$f":"'(2)SupportAssessMatrix'!A71","v":"Construction "},{"$f":"'(2)SupportAssessMatrix'!C71","v":"Access Track Requirement"},{"$f":"'(2)SupportAssessMatrix'!G71","v":0.13},{"$f":"'(2)SupportAssessMatrix'!J71","v":5.8823529411764705E-2},{"$f":"'(2)SupportAssessMatrix'!L71","v":7.6470588235294122E-3}]
[36,{"$f":"'(2)SupportAssessMatrix'!B61","v":"M.9"},{"$f":"'(2)SupportAssessMatrix'!A61","v":"Mechanical & Electrical"},{"$f":"'(2)SupportAssessMatrix'!C61","v":"Familiarity with Attachment Arrangement"},{"$f":"'(2)SupportAssessMatrix'!G61","v":0.13},{"$f":"'(2)SupportAssessMatrix'!J61","v":0.1111111111111111},{"$f":"'(2)SupportAssessMatrix'!L61","v":1.4444444444444444E-2}]
[5,{"$f":"'(2)SupportAssessMatrix'!B30","v":"E.5"},{"$f":"'(2)SupportAssessMatrix'!A30","v":"Electrical"},{"$f":"'(2)SupportAssessMatrix'!C30","v":"Earthing Performance"},{"$f":"'(2)SupportAssessMatrix'!G30","v":0.13},{"$f":"'(2)SupportAssessMatrix'!J30","v":0.1},{"$f":"'(2)SupportAssessMatrix'!L30","v":1.3000000000000001E-2}]
[6,{"$f":"'(2)SupportAssessMatrix'!B31","v":"E.6"},{"$f":"'(2)SupportAssessMatrix'!A31","v":"Electrical"},{"$f":"'(2)SupportAssessMatrix'!C31","v":"Lightning Performance"},{"$f":"'(2)SupportAssessMatrix'!G31","v":0.13},{"$f":"'(2)SupportAssessMatrix'!J31","v":0.1},{"$f":"'(2)SupportAssessMatrix'!L31","v":1.3000000000000001E-2}]
[8,{"$f":"'(2)SupportAssessMatrix'!B33","v":"E.8"},{"$f":"'(2)SupportAssessMatrix'!A33","v":"Electrical"},{"$f":"'(2)SupportAssessMatrix'!C33","v":"Surge Impedance Loading (SIL) "},{"$f":"'(2)SupportAssessMatrix'!G33","v":0.13},{"$f":"'(2)SupportAssessMatrix'!J33","v":0.1},{"$f":"'(2)SupportAssessMatrix'!L33","v":1.3000000000000001E-2}]
[83,{"$f":"'(2)SupportAssessMatrix'!B109","v":"T.1"},{"$f":"'(2)SupportAssessMatrix'!A109","v":"Other"},{"$f":"'(2)SupportAssessMatrix'!C109","v":"Susceptibility to damage (vandalism/accident)"},{"$f":"'(2)SupportAssessMatrix'!G109","v":0.12},{"$f":"'(2)SupportAssessMatrix'!J109","v":0.16666666666666666},{"$f":"'(2)SupportAssessMatrix'!L109","v":1.9999999999999997E-2}]
[84,{"$f":"'(2)SupportAssessMatrix'!B110","v":"T.2"},{"$f":"'(2)SupportAssessMatrix'!A110","v":"Other"},{"$f":"'(2)SupportAssessMatrix'!C110","v":"Resistance of materials to deterioration/attack"},{"$f":"'(2)SupportAssessMatrix'!G110","v":0.12},{"$f":"'(2)SupportAssessMatrix'!J110","v":0.16666666666666666},{"$f":"'(2)SupportAssessMatrix'!L110","v":1.9999999999999997E-2}]
[85,{"$f":"'(2)SupportAssessMatrix'!B111","v":"T.3"},{"$f":"'(2)SupportAssessMatrix'!A111","v":"Other"},{"$f":"'(2)SupportAssessMatrix'!C111","v":"Number of supports per km of OHL"},{"$f":"'(2)SupportAssessMatrix'!G111","v":0.12},{"$f":"'(2)SupportAssessMatrix'!J111","v":0.16666666666666666},{"$f":"'(2)SupportAssessMatrix'!L111","v":1.9999999999999997E-2}]
[86,{"$f":"'(2)SupportAssessMatrix'!B112","v":"T.4"},{"$f":"'(2)SupportAssessMatrix'!A112","v":"Other"},{"$f":"'(2)SupportAssessMatrix'!C112","v":"Embodied energy (embodied carbon)"},{"$f":"'(2)SupportAssessMatrix'!G112","v":0.12},{"$f":"'(2)SupportAssessMatrix'!J112","v":0.16666666666666666},{"$f":"'(2)SupportAssessMatrix'!L112","v":1.9999999999999997E-2}]
[87,{"$f":"'(2)SupportAssessMatrix'!B113","v":"T.5"},{"$f":"'(2)SupportAssessMatrix'!A113","v":"Other"},{"$f":"'(2)SupportAssessMatrix'!C113","v":"Cost of supports (per km)"},{"$f":"'(2)SupportAssessMatrix'!G113","v":0.12},{"$f":"'(2)SupportAssessMatrix'!J113","v":0.16666666666666666},{"$f":"'(2)SupportAssessMatrix'!L113","v":1.9999999999999997E-2}]
[88,{"$f":"'(2)SupportAssessMatrix'!B114","v":"T.6"},{"$f":"'(2)SupportAssessMatrix'!A114","v":"Other"},{"$f":"'(2)SupportAssessMatrix'!C114","v":"Side slope - effect on height"},{"$f":"'(2)SupportAssessMatrix'!G114","v":0.12},{"$f":"'(2)SupportAssessMatrix'!J114","v":0.16666666666666666},{"$f":"'(2)SupportAssessMatrix'!L114","v":1.9999999999999997E-2}]

{"sheet":"(4)Assessment Rationale","index":3,"n_rows":93,"n_cols":4,"rows_kept":93,"cut":false,"hidden":false,"merged":[]}
["ASSESSMENT RATIONALE"]
[]
["Main Design Aspect","Ref","Design Aspect","Notes on Design Aspect"]
[]
["Electrical","E.0","General","Given that the supports are designed with the same conductor the electrical aspects are mainly a function of the conductor and earthwire positions. The electrical design aspects consider the effects on system operation and environmental effects (i.e. audible noise & EMF). "]
["Electrical","E.1","Audible Noise","The principal driver for whether or not AN is likely is the conductor surface voltage gradient (CSVG).  Therefore in order to compare and score the eight options, the highest value of CSVG for each configuration provides the relative score. \nFor the purposes of comparison, all calculations are taken at minimum height above ground (7.1m) and assuming that the earthwire sag is the same as the phases. \nThe same calculations for relative AN as per EL’s Stage 3 Report are used. "]
["Electrical","E.2","Magnetic Fields (External)","The calculated values in microteslas generated by the MAGNETO 2D modelling software (V9.3) are used to provide a relative score. The software can produce field profiles over any range and for these studies and in this case range of +/- 100m from centreline was selected. Further, the minimum height clearance of bottom phase conductor to ground of 7.1 was chose to give worst case representation of EMFs for comparison, rather than average values often quoted."]
["Electrical","E.3","Electric Fields (External)","Similar to E.2, the calculated values in kV/m are presented for +/- 100m from the centreline on the support as calculated by the ELECTRO 2D modelling software (V9.3) to provide a relative score for the SAM."]
["Electrical","E.4","Radio Interference","In a similar way to AN, the principal driver for whether or not RI is likely is the CSVG and using that value in formulas described in EL’s Stage 3 Interim Report (90SS545-REP-002) yields scores for the SAM."]
["Electrical","E.5","Earthing Performance","The eight options include lattice steel or steel poles, with twin earthwires.  On the assumption that appropriate earthing to ground through footings shall be installed for all options, this design aspect is considered to be a very minor scoring factor.  The surge impedance of the tower will depend upon the volume of steel, its connected components and the interconnected paths.  For the purposes of scoring, a twin pole or lattice, inter-connected support is given a higher relative score than independent single poles.  This aspect has been ranked manually using engineering judgement."]
["Electrical","E.6","Lightning Performance","With the application of twin earth wires, the shielding performance of all eight options will be very good when compared to single earthwire applications.  All options are under 30m in height save for 570 series and so scoring is simply based upon the angle subtended between the vertical under the earthwire and the top phase, except for the twin crossarm options 540 and 560 which feature phase conductors displaced further from the vertical from the earthwire and as such most extreme phase angle is measured.\nFor the purposes of comparison, the score for Option 570 is adjusted down manually to account for its height of 37m.  "]
["Electrical","E.7","Insulation Coordination","Studies of IC require details of the system as a whole and as such, all options here would be considered by application.  As such, scoring for SAM purposes is considered inappropriate and as such all options are scored equally."]
["Electrical","E.8","Surge Impedance Loading (Sil) ","Generally as conductor separations are reduced (in compact designs for example), the increase in capacitance tends to reduce the surge impedance which in turn increases the SIL. SAM scoring is based upon the geometric mean of the phase conductor separation values to give a relative comparison."]
["Electrical","E.9","Electric Fields Within/Near Structure","The calculated values in kV/m provide a relative score for the SAM for the Electric Fields near the structure (on centreline).\nFor the purposes of assessing non-outage access conditions, the maximum value of electric field at the centre of the crossarms was calculated.  Such values are so far below recommended limits for workers that the impact on option selection is deemed irrelevant and so this has been weighted low."]
["Electrical","E.10","Magnetic Fields Within/Near Structure","The calculated values in microteslas provide a relative score for the SAM for the Electric Fields near the structure (on centreline).\nFor the purposes of assessing non-outage access conditions, the maximum value of electric field at the centre of the crossarms was calculated.  Such vales are so far below recommended limits for workers that the impact on option selection is deemed irrelevant and so this has been weighted low."]
[null,null,""]
["Supports & Foundations","S.0","General","The Supports & Foundations MDA is principally concerned with the structural performance of these two main components of an overhead line. The implications for design efficiency are a key consideration this MDA."]
["Supports & Foundations","S.1","Number of Elements","Taking into account the risks associated with each member of a structure, arising from design, manufacture and construction etc., the number of elements in a structure can be taken as an indicator of the reliability of the full structure. Structures with fewer numbers of members are considered to have an inherent design advantage over structures with greater numbers of members.\nThe 'number of elements' design aspect score for any particular Form has been calculated by comparing the corresponding number of elements in the Form to the individual totals for the other 7 short-listed Forms. Forms with numbers of elements greater than 50 have been given minimum score 1."]
["Supports & Foundations","S.2","Number of Joints","Taking into account the risks associated with each joint within a structure, arising from design, manufacture and construction etc., the number of joints in a structure can be taken as an indicator of the reliability of the full structure. Structures with fewer numbers of joints are considered to have an inherent design advantage over structures with greater numbers of joints. The 'number of joints' design aspect score for any particular Form has been calculated by comparing the corresponding number of joints in the Form to the individual totals for the other 7 short-listed Forms."]
["Supports & Foundations","S.3","Side Slope Added Complexity","Supports that have a wide foot print are more difficult to construct in hilly terrain due to the ground level differences. The difference in ground level across a support is an indicator of the additional measures that may be required in the design and the construction of the support. Transverse ground gradients also impact on ground to phase clearance and correspondingly on support heights. For the purposes of the study two dimensions have been noted for each Form: the maximum difference in ground level across the Form arising from a transverse slope of 30°; and the reduction in clearance to bottom phase conductors arising from the same gradient, compared to the clearance in level ground. The sum of these two 'hilly ground dimensions', the hilly terrain index, has been taken as an indicator of the implications of construction in hilly terrain. The 'hilly terrain' design aspect score for any particular Form has been calculated by comparing the hilly terrain index for the Form to the hilly terrain indices of the other 7 short-listed Forms."]
["Supports & Foundations","S.4","Weight of Structure (Per km)","The overall weight of a support impacts on construction, manufacture, embodied energy and resource consumption, and as such it is considered to be a key indicator of good design. The weight of supports per km have been calculated for each form, in order to take into account differences in standard spans. The 'weight of structure' design aspect score for any particular Form has been calculated by comparing the weight/km for the Form to the weight/km values of the other 7 short-listed Forms."]
["Supports & Foundations","S.5","Suitability to use of Alternative Materials","For the purposes of the study the construction material has been limited to steel. However, for each Form a subjective assessment has been made of the practicality of incorporating alternative materials into the support, such as fibre reinforced plastic tubes, glulam timber poles and crossarms, and concrete poles. Typically lattice forms of construction are not suited to the use of alternative materials, whereas poles are suited to the use of alternative materials, especially if simple connection designs can be developed. The 'alternative materials' design aspect score for any particular Form has been allocated on a subjective basis taking into account strength and manufacturing considerations. calculated by comparing the cost/km for the Form to the cost/km values of the other 7 short-listed Forms."]
["Supports & Foundations","S.6","Reduction in Reliability in Single Circuit Configuration (i.e. Strung One Side)","When 2 circuits are supported circuit 1 tends to balance circuit 2; when only one circuit is supported an out of balance moment results as a consequence. In order to quantify this effect,  the moment arising from dead load in the 2-circuit balanced condition has been compared to the moment arising from the 1-circuit out of balance condition. The change in gravity load, overturning moment arising from a change from double circuit to single circuit configuration is taken to be an indicator of suitability for  single circuit lines. The 'single circuit' design aspect score for any particular Form has been calculated by comparing the increase in overturning moment  for the Form to the increases in overturning moment for the other 7 short-listed Forms."]
["Supports & Foundations","S.7","Ice Accretion Performance","OHL supports are subject to ice accretion. The weight of the ice that forms on the supports, and also the wind load that is collected by the ice augmented projected area of the support, have to be resisted by the support.  Clearly, the less ice that a support attracts the better. The surface area of the supports has been taken as an indicator of proneness to icing effects. The 'ice accretion' design aspect score for any particular Form has been calculated by comparing the surface area of the Form to the surface areas of the other 7 short-listed Forms."]
["Supports & Foundations","S.8","Area for Painting","Structural steel requires protection against corrosion. The cost of both initial corrosion protection measures, and maintenance of corrosion protection is determined to a large extent by the surface area to be protected. The 'surface protection' design aspect score for any particular Form has been calculated by comparing the surface area of the Form to the surface areas of the other 7 short-listed Forms."]
["Supports & Foundations","S.9","Implications of Addition of Extensions","The heights of supports are typically increased from the standard height where spans exceed the standard span, this being to achieve in-span clearances to ground.  The heights of supports with vertical tube legs can be easily increased by adding tube extensions, with very little increase in footprint area. The heights of typical tower supports can be increased in height by adding combinations of body and/or leg extensions; the increase in footprint area is greater than the corresponding increase in area associated with tube extensions, and the visual impact of extensions is greater also. Correspondingly lattice steel supports have lower scores than tube supports.  In the case of the series 570 support (x-pylon), extensions would also not match the aesthetics of the standard height support thus attracting a further reduction in score. The 'height extension' design aspect score for any particular Form has been allocated subjectively."]
["Supports & Foundations","S.10","Length of Load Path","The loads collected by the conductors and earthwire pass through the support structures to ground. The length of load-path is a structural indicator; short, direct load paths are considered to be beneficial. For the purposes of the study, main load paths have been identified by inspection and the maximum load path lengths for 6 conductors and 2 earthwires for each suspension Form have been summed. The 'load-path' design aspect score for any particular Form has been calculated by comparing the corresponding load-path total to the individual totals for the other 7 short-listed Forms."]
["Supports & Foundations","S.11","Familiarity with Form (Familiar Forms Score High)","'Familiarity of form' is considered to be advantageous to design reliability, in that testing data and historical records (relating to actual performance in service), back up the design principles and methods that have been used to design those familiar forms. The 'familiarity of form' design aspect score for any particular Form has been allocated subjectively."]
["Supports & Foundations","S.12","Foundation Complexity","Foundations to traditional lattice steel towers are typically simple in concept in that they resist essentially compression and/or uplift loading; overturning moments are relatively small, these arising from residual shears at ground level. Pole supports are such that significant overturning moments are generated at ground level; foundations to poles are therefore required to resist moments as well as vertical loads, and as such the design of foundations to poles require greater design effort. For the purposes of the study, supports requiring only simple uplift/compression foundations have been scored 8; supports requiring moment resisting foundations to a standalone pole a score of 4; and supports that require moment resisting foundation to two or more closely spaced poles (shared foundation) a score of 2."]
["Supports & Foundations","S.13","Foundations (Volume of Concrete Per km)","The volume of concrete in foundations to supports impacts on construction, manufacture, embodied energy and resource consumption, and as such it is considered to be a key indicator of good design. The volume of concrete required to construct foundations has been calculated on a unit line length basis to take into account differences in standard spans. The 'concrete volume' design aspect score for any particular Form has been calculated by comparing the volume/km for the Form to the volume/km values of the other 7 short-listed Forms."]
["Supports & Foundations","S.14","Foundations (Volume of Excavation Per km)","The volume of excavation required to construct foundations to supports impacts on construction, manufacture, and embodied energy , and as such it is considered to be a indicator of good design. Supports that require smaller excavations for construction of foundations are considered to offer an advantage over those that require more extensive excavations. The volume of excavation required to construct foundations has been calculated on a unit line length basis to take into account differences in standard spans. The 'excavation volume' design aspect score for any particular Form has been calculated by comparing the volume/km for the Form to the volume/km values of the other 7 short-listed Forms."]
["Supports & Foundations","S.15","Suitability for the Application of Two Earthwires","Three scores have been allocated on a subjective basis: 9 for two pole supports that require no modification for support of earthwires (including the X-pylon), 2 for mono-pole supports and 2-pole supports that require modification for support of earthwires, and 1 for lattice towers."]
[null,null,""]
["Mechanical & Electrical","M.0","General","Given that the conductor design is a constant for the assessment. the main variable for the mechanical & electrical design aspect is the configuration of the conductor system (including insulators). The implications of the support design on the need to use new insulator arrangements and materials has also been considered.  "]
["Mechanical & Electrical","M.1","Insulation Mechanical Reliability","Reliability of the insulation in mechanical terms will increase with the provision of more than one insulator string i.e. 'V' or horizontal vee. If an insulator were to fail in either  case the conductor would not be dropped and would be upheld by the remaining insulator."]
["Mechanical & Electrical","M.2","Insulation Material Limitation","Horizontal vee (and other ICA arrangements) use composite insulation exclusively. Whilst this in itself is not a negative; the inability to specify glass or ceramic insulation in some circumstances may be a disbenefit both in terms of insulation performance as well as cost."]
["Mechanical & Electrical","M.3","Number of Insulators","The number of insulators used has an effect on the complexity and amount of components used. It also has a negative effect for disposal and recycling. An increased number of insulators also increases the probability of component failure.\nI string insulators have been marked high for their simplicity and only being one unit, followed by V and horizontal V arrangements which have double the amount of insulators. "]
["Mechanical & Electrical","M.4","Galloping (Susceptibility to Conductor Clashing)","Conductor galloping is a poorly understood phenomena that can affect OHL conductors: the aerodynamic lift effects of wind flowing past ice covered conductors can result in non-synchronised  resonant oscillation of conductors, and this can result in contact or flashover. The susceptibility of a conductor configuration to adverse galloping effects can be studied by drawing ellipses around each conductor, to signify the positions in space that a conductor  may be found during wind excited motion. There are a number of methods in use for determination of ellipse geometry, one of which is presented in CIGRE publication 322. For the purposes of the study the area of overlap between ellipses has been taken as an indicator of susceptibility to adverse galloping effects. The 'galloping' design aspect score for any particular Form has been calculated by comparing the area of ellipse overlap for the Form to the area of ellipse overlap values of the other 7 short-listed Forms."]
[null,"M.5","Formation of Jumpers at Angle Supports","The formation of jumpers on supports with 1 x 700mm2 (single araucaria) is likely to be difficult due to the stiffness of the conductor to form short loops. In addition, the termination clamp would likely be preferred to be wedge type to avoid the formation of hotspots, it may be necessary to form the jumpers from multiple smaller diameter conductors to allow for the  tight radius required. \nThere is no discernible difference between support forms in terms of the formation of jumpers."]
[null,"M.6","Angle Support Insulation","Insulator complexity at angle supports can be considered in terms of the number of post insulator elements required. I.e. conventional angles will score highly, angles with a post to offset the jumper will be scored in the mid range and angle supports that employ a 4 leg ICA design will be considered least favourably."]
[null,"M.7","Type Testing  Requirements","The type test requirements for horizontal vee insulation may be more onerous than that of 'I' or 'V' arrangements, it has been suggested in some sources that type testing of the individual insulator units as well as the whole horizontal vee assembly be type tested."]
["Mechanical & Electrical","M.8","Suitability for ICA Adaption","The suitability is a qualitative assessment of how a design may lend itself to the adaption of ICA technology. In general, designs without ICAs already, do not lend themselves to the technology, especially those which do not have a vertical configuration of conductors."]
[null,"M.9","Familiarity with Attachment Arrangement","The attachment of the horizontal vee assembly as opposed to conventional arrangements will be different to the norm therefore the familiarity for linesmen to the component will be low. However, this is not deemed to be a significant issue and as such has been weighted as 0."]
[null,null,""]
["Construction ","C.0","General","The construction assessment is based on what are currently 'conventional' activities and procedures for continuous tension stringing.\nThere are assumptions and limitations which are common for all of the following design aspects.\nThe construction assessment is based on existing OHL construction techniques. The design of attachment points and access fittings have not yet been developed; the basis of the construction assessment is that, in particular, the pole type supports would require further design considerations for 'in built' access facilities and rigging attachment points."]
["Construction ","C.1","Support Supply Chain Familiarity","Any new supplier must undergo the prequalification process with the contractor, for steel lattice supports in the UK contractors have prequalified steel suppliers. Steel pole type supports, being relatively new in the UK, may generally require additional prequalification with new suppliers, although some tubular design OHL HV structures have been erected in the UK. Consideration has been given to the increased supply chain for the guyed crossarm supports."]
["Construction ","C.2","Insulation Supply Chain Familiarity (Composite)","The application of new insulator technology and / or arrangements (for UK application) may require the prequalification of new suppliers and extensive test procedures.  Composite insulation could be considered for all insulator arrangements therefore there is deemed to be no difference between the scoring of each support."]
["Construction ","C.3","Support Type Testing","An innovative support (all 8 supports) may have implications on the test methods used and/or compatibility issues with existing test facilities."]
["Construction ","C.4","Support Check Erect","The check erect procedure can be impacted upon by the amount of components and complexity of the support i.e. in the case of lattice steel supports the increased number of components makes structures more difficult to check/ inspect."]
["Construction ","C.5","Complexity of Support (Fabrication)","The complexity of the structure is a fabrication consideration and is considered in terms of the amount of elements in the structure:\n• Increased number of components increases the potential for mal-fabricated elements / QA issues."]
["Construction ","C.6","Foundation Construction (Footprint)","Foundation construction is considered in terms of the area/ number of excavation(s) as the biggest factor in increased timescales and environmental impact (development of access) to the site. As the footprint of structure increases then the working area required for foundation installation increases accordingly, again increasing the environmental impact on the area. \nGround conditions would dictate the design of the foundation with a corresponding effect on the working area. "]
[null,"C.7","Support Footprint & Assembly Area","Lattice structures will generally require a large footprint of land for assembly and erection. Gradients in the site may impact on the requirement to develop the area further to make it suitable as an assembly / erection area, potentially having an increased environmental impact.\nMonopoles provide a more linear approach to the requirements of an assembly / erection area and reductions on the environmental impact on site."]
["Construction ","C.8","Support Transport & Storage","Generally, the current transportation to site and storage methods for lattice steel towers generally involve:\n• Delivery of steelwork to a central site / storage area\n• Inspection and bundling of tower components for onward delivery to the tower site for assembly / erection.\nThe use of supports with fewer elements may negate the need to deliver to a central site for inspection and instead allow the support to be delivered directly to the support site.\nIn the case of supports with fewer larger elements (steel poles) consideration will need to be given to the section sizes to allow standard transportation methods to be utilised. ."]
["Construction ","C.9","Access Track Requirement","Access requirements are dictated by the equipment required for support and foundation transport and construction as well as the ground conditions. New pole type supports may offer a reduction in the effort (and cost) required for access track construction and reinstatement. "]
["Construction ","C.10","Ease of Support Assembly / Erection","Lattice steel supports generally require more time and resource for assembly and erection. Temporary support(s) may be required to the lower sections of larger lattice structures during the erection process.\nTubular supports would generally require less resource and offer stability (self stabilising) to the structure during the erection process from ground level through to completion."]
["Construction ","C.11","Support Access/ Egress/ Rescue","Permanent attachment/ fall arrest systems can be designed into any proposed OHL structure.\nLattice structures create more of a challenge to have ‘in-built’ systems during erection as opposed to that of a tubular structure.\nTubular structures could have a permanent attachment system included during the fabrication process."]
["Construction ","C.12","Need for Insulator Temporary Restraint","Horizontal 'V' insulators will require restraint from swinging  laterally during conductor installation activities. This adds an extra process which has a corresponding time and cost element as well as additional equipment requirements."]
["Construction ","C.13","Conductor Installation Process","The conductor system configuration can have an effect on the pilot bond installation process which can be either ground based or utilises a helicopter. Land based activities will increase the access requirements.\nVertically aligned conductor configurations, where each conductor attachment point is to the point of the conductor support, allow for the use of helicopters, providing a more efficient and timely method for pilot bond installation.\nIt is considered that current procedures for continuous tension stringing can be used / adapted on the proposed structures although conductor access methods and equipment for work on tubular structures may have to be developed. "]
["Construction ","C.14","Insulator Conductor Attachment Point","In this context Standard/ Non Standard relates to I and V string insulators or horizontal 'V' (ICA) respectively. \nVertical ‘I’ and ‘V’ strings provide ease of access to both the structure and conductor attachment points. \n'V' string insulators will require additional rigging time for installation and removal in comparison with 'I' string insulators.\nMethods for access to conductor attachment points may have to be developed for horizontally configured insulators but is considered to be a minor barrier to overcome"]
["Construction ","C.15","Refurbishment inc. E/W - 1 cct Live Proximity","The activities envisaged which will require single circuit outages on double circuit systems are:\n• Refurbishment of circuit only\n• Refurbishment of circuit and earthwire\n• Replacement of earthwire\n• Replacement of damaged conductor(s)\n• Installation of temporary masts \nThe key factor for consideration is the separation between circuits when conductor works are taking place adjacent to a live circuit.\nStructures which increase the distance between circuits are considered more favourably. \nSupport design references 530, 540 and 560 would negate the use of a temporary mast when considering the current temporary mast designs that are available. \nA double earthwire system can negate clearance issues that currently exist where a single earthwire is installed on double circuit systems, and access to the earthwire is limited with live circuits. "]
["Construction ","C.16","Route Dismantling","Current conductor removal procedures could be considered for all the proposed supports. \nCurrent procedures for the removal of insulators could be considered again for all of the proposed supports.\nAll supports have been considered to be dismantled by the use of cranes.\nThe removal of complete foundations is considered as part of the route dismantling and in general terms the bigger and more complex the foundation the more material there will be for removal and disposal. And subsequently increase the imported backfill quantities.\nThe storage / disposal of all recovered materials would be in line with the regulations in force at the time of recovery."]
["Construction ","C.17","Tension Support","All proposed tension supports tend to lend themselves to current continuous tension stringing procedures with the exception of 4 legged insulator configuration where the area for rigging is limited."]
[null,null,""]
["Maintenance","R.0","General","Access for pole type supports is likely to require the addition of permanent attachment points and/or ladders, to enable climbing and in addition suitable facilities to allow rigging for raising and lowering equipment (for example the provision of a lifting jib).\nIt has been assumed at this stage that all pole type supports can be designed with these attachment points and that the poles are steel.\nIn considering the various aspects of the Maintenance elements of the SAM one of the main considerations has been how these items affect Health and Safety as well as System safety and security."]
["Maintenance","R.1","Ancillary Equipment (Including Third Party)","Requirements for facilities to fit satellites/ antennas."]
["Maintenance","R.2","Main Component Replacement","Work on towers not involving the connection or disconnection of conductors - using conventional techniques and equipment.\nExamples of tasks considered:\n>Repair/ replacement of worn conductor fittings such as; suspension saddles, links, shackles and dampers.\n>Replacement of damaged insulator(s)\n>Replacing worn insulator fittings such as; links, shackles, arcing horns and corona rings."]
["Maintenance","R.3","Suitability for Operational Activities (E.G. Isolation)","The removal of jumpers to provide electrical isolation and cross-jumpering.  Tension supports with ICAs will not provide adequate clearances to facilitate electrical isolation by removing jumpers using conventional methods - this may necessitate consideration of identifying strategic tension towers that require normal crossarms. Danube configuration supports may be difficult to apply cross-jumpering due to phase to phase clearances."]
["Maintenance","R.4","Main Component Replacement to Earthwires","Work not involving the lowering , raising or increasing the sag of the earthwire conductor.  \nExamples of tasks considered;\n>Repair/ replacement of earthwire conductor saddles and associated fittings such as; shackles, links etc.\n>Repair/ replacement of earth bonds and for tension support jumpers     \n>Replacement of damaged/ worn dampers\n>Repair of fibre optic systems"]
["Maintenance","R.5","Phase Conductor System Repairs - 1 cct Live Proximity","Standard techniques used to lower and raise phase conductors at tension and suspension supports for example to carry out repairs to damaged conductors or remove foreign objects. The primary criteria is that of safety from adjacent live circuits (i.e. larger  cct-cct separation = higher score)"]
[null,"R.6","Earthwire Conductor System Repairs - 1cct Live Proximity","Standard techniques would be used to lower and raise earthwire conductors at tension supports for example to carry out repairs to damaged earthwire conductors, remove foreign objects and carry out repairs to fibre optic earthwires. The primary criteria is that of safety from adjacent live circuits (i.e. larger  earthwire-cct separation = higher score)"]
["Maintenance","R.7","Surface Preparation & Treatment/ Deterioration Protection","Suitability of supports for surface preparation and protection using existing methods. \n>Surface area\n>Ease of access (inc. element size)\n>Outage requirements\n>Non-outage working"]
["Maintenance","R.8","Condition Assessment Remote (Ground/ Aerial)","Suitability for the support to be visually inspected either from ground or aerial with minimal obstruction of the full support as well as conductors, insulator and fittings. And assessment of high resistance joints."]
[null,"R.9","Condition Assessment Intrusive (Climbing)","Suitability for the support to be visually inspected from the support body with minimal obstruction of the full support as well as conductors, insulator and fittings."]
[null,null,""]
["Operational Safety","O.0","General","The safe access and egress to the supports for maintenance and/ or repair work is vital to the support design.\nIn considering the various aspects of the Operation elements of the SAM one of the main considerations has been how these items affect Health and Safety as well as System safety and security."]
["Maintenance","O.1","Access/ Egress/ Rescue","Suitability of supports to:\n>Give ergonomic access to the support\n>Accept adequate fall arrest equipment\n>Provide clearances to live circuits\n>Allow personnel rescue"]
["Maintenance","O.2","Live Line Working","At support live line working in all cases will require development of techniques and equipment.  "]
["Maintenance","O.3","Management of Induced Voltages / Currents / Application of Additional Earthing","The issue of applying earthing systems / procedures for the management of induced voltages/ currents is anticipated to be similar for all supports. Provision of earth end attachment points."]
["Maintenance","O.4","Circuit Demarcation","Requirements for supports to meet current industry standards for demarcation."]
[null,null,""]
["Environmental","P.0","General","The impact of the support on the landscape and ecology (particularly the effect on birds) is an important consideration especially when considering planning policy and the issues which surround consenting of new routes. "]
["Environmental","P.1","Height","Tall supports may have a more negative visual impact than shorter ones. Shorter supports can be more easily hidden in the landscape using Holford's routing guidelines. \"The use of low height towers has been successful in reducing the visual impact of towers\" (Turnbull, 2004, p.69)\n\"increased height will generally also mean visibility which (possibly) creates impact over a large area\" (Bishop, 1985, p.198)"]
["Environmental","P.2","Supports per km","Shorter spans will increase the perceived lateral density of the route"]
["Environmental","P.3","Insulator Visual Impact","Insulators are often the most visible feature of a support, therefore reducing the number of insulators used on each support can help reduce the visual impact. Also Horizontal V insulators have scored lower than V due to the thickness of the posts.\n\"because of their shape, insulator strings always present a convex surface towards the viewer…the effect of this... is often to make the insulators visible even when the towers to which they are attached are not easily seen.\" (Turnbull & McAulay, 2004, p.60)"]
["Environmental","P.4","Transparency (Back Clothing)","Some supports such as lattice steel can appear almost transparent against certain back cloths and therefore have scored highly. Solid supports do not benefit from this function. The transparency of the poles has been quantified by calculating the total area of each element with the largest area scoring the lowest. \n\"The ratio of solid steelwork to the overall profile area in less than 1:10…making the tower take on the colour and texture of its visual background\" (Turnbull & McAulay, 2004, p.27)\n\"Generic steel pole designs were examined by two landscape architects and were judged \nto be more obtrusive in Irish rural landscapes (generally rolling) than lattice steel towers which were seen to have a capacity for diffusion.\" (Doyle et. al., 2010, p.2)"]
["Environmental","P.5","Conductor Arrangement (Compact/ Open)","Compacted conductor arrangements (i.e. low mean phase-phase spacing) may be more visible in the landscape than widely distributed formations. \nThis may create a denser wirescape, similar to conductor bundling(although not as pronounced) where \"bundles of conductors are generally more visible than equivalent single conductors.\" (Turnbull & McAulay, 2004, p. 55) "]
["Environmental","P.6","Support  Shape (Eiffelised/ Top Heavy Etc.)","Research shows that 'top heavy' supports can be perceived as unstable. Supports with a tapered top have the opposite affect and look lighter overall so these have scored higher.\n\"making a tower too thin, especially when top loaded…would afford the viewer a sense that the tower was unstable and unsafe (JJB, 2008, p.4)"]
["Environmental","P.7","Crossarms","Upturned crossarms are perceived as having a more positive visual effect than down turned crossarms. \n\"The characteristic upturned cross arms are intended to give the tower a lighter appearance.\" According to Crowe, \"a fault in the then current transmission tower design was that the drooping arms led the eye down instead of skywards.” (Turnbull & McAulay, 2004)\n"]
["Environmental","P.8","Design Aesthetics","Planning policy states that good design must be considered.  Design aesthetics have been ranked subjectively based on criteria such as elegance and sophistication. The scoring also represents what we feel would reflect public opinion.\n\"Applying 'good design' to energy projects should produce sustainable infrastructure sensitive to place\" (DECC, 2011)"]
["Environmental","P.9","Corridor Width","The right of way considers the corridor width required for the whole route i.e. the conductor width (not including sag/swing). A large right of way could potentially be more difficult to get planning permission for, and cause problems in terms of loss of habitat."]
["Environmental","P.10","Footprint","Land take refers specifically to the foot print of the tower. A smaller land take may be preferred by the land owner, as well as potentially effect the outcome of planning permission.\n\"Cable stays dramatically increase the footprint of the tower relative to a lattice steel tower and present an obstacle for farm machinery\" (JJB, 200b, p.5)"]
["Environmental","P.11","Effect on Birds","The risk of birds (in particular larger birds such as raptors, geese and swans) colliding with overhead lines may increase with the height of the support. Shorter supports can be more suitably routed, such as behind buildings, trees etc.\n\"constructions shall obstruct only a minimum of air space in vertical direction\" (Hass, 2005, p.26)\nThe earth wire tends to be 'the highest, thinnest and most problematic component' (Eirgrid, 2012, p.31). It is often less visible than the conductors, 'in certain situations appear almost invisible because of the background or lighting conditions' (Scottish Gov.) and therefore many of the collisions take place when birds increase the height of their flight path to avoid the conductors and consequently fly into the earth wire. It is suggested that the closer the earth wire is to the rest of the conductors, the better it is for birds. \n\"Even more favourable are those...which use no neutral cable at all\" (Hass, 2005, p.16)\nThe conductor arrangement of a support can have the most dramatic impact on bird safety. Multi-level conductor arrangements have scored low as they are considered more difficult for birds to avoid than single level arrangements. \n\"Highest risks are posed by those power lines, where the conductors are arranged at different heights\" (Hass, 2005, p.16)\nThe scores for each of the above three aspects have been quantified, combined, and weighted, with the conductor arrangement being the most important aspect. \nDepending on the policy of the utility it may be possible to also include the probability of birds nesting on the structure and accounting for the negative operational effects this may have. "]
["Environmental","P.12","Tension Support Continuity","Tension support designs were assessed in relation to 'continuity' with the rest of the route, i.e. how well they resembled the corresponding suspension support. Overall scores were applied to a number of different aspects that were recognised as being 'similar' or 'different' from the corresponding suspension tower. The identified modifications included aspects such as change in tower height, width, & pole thickness, etc. These individual aspects were calculated and averaged to gain a relative score. "]

{"sheet":" (5) NeSTS Assessment","index":4,"n_rows":185,"n_cols":48,"rows_kept":185,"cut":false,"hidden":false,"merged":[[22,31,22,32],[22,34,22,35],[22,37,22,38],[22,40,22,41],[35,0,35,2],[35,13,35,14],[35,16,35,17],[35,19,35,20],[35,22,35,23],[35,25,35,26],[22,13,22,14],[22,16,22,17],[22,19,22,20],[22,22,22,23],[22,25,22,26],[22,28,22,29],[51,0,51,2],[51,13,51,14],[51,16,51,17],[51,19,51,20],[51,22,51,23],[51,37,51,38],[51,40,51,41],[35,28,35,29],[35,31,35,32],[35,34,35,35],[35,37,35,38],[35,40,35,41],[61,25,61,26],[51,25,51,26],[51,28,51,29],[51,31,51,32],[51,34,51,35],[61,0,61,2],[61,13,61,14],[61,16,61,17],[61,19,61,20],[61,22,61,23],[79,0,79,2],[79,13,79,14],[79,16,79,17],[79,19,79,20],[79,22,79,23],[79,37,79,38],[79,40,79,41],[61,28,61,29],[61,31,61,32],[61,34,61,35],[61,37,61,38],[61,40,61,41],[89,25,89,26],[79,25,79,26],[79,28,79,29],[79,31,79,32],[79,34,79,35],[89,0,89,2],[89,13,89,14],[89,16,89,17],[89,19,89,20],[89,22,89,23],[94,0,94,2],[94,13,94,14],[94,16,94,17],[94,19,94,20],[94,22,94,23],[94,37,94,38],[94,40,94,41],[89,28,89,29],[89,31,89,32],[89,34,89,35],[89,37,89,38],[89,40,89,41],[107,25,107,26],[94,25,94,26],[94,28,94,29],[94,31,94,32],[94,34,94,35],[107,0,107,2],[107,13,107,14],[107,16,107,17],[107,19,107,20],[107,22,107,23],[114,0,114,2],[114,13,114,14],[114,16,114,17],[114,19,114,20],[114,22,114,23],[114,40,114,41],[107,28,107,29],[107,31,107,32],[107,34,107,35],[107,37,107,38],[107,40,107,41],[114,25,114,26],[114,28,114,29],[114,31,114,32],[114,34,114,35],[114,37,114,38]]}
["MDA Weightings",null,null,null,null,null,null,null,null,null,null,null,null,"L8RD M4.9",null,null,"510 SERIES",null,null,"510X SERIES",null,null,"520 SERIES",null,null,"530 SERIES",null,null,"540 SERIES",null,null,"550 SERIES",null,null,"560 SERIES",null,null,"570 SERIES",null,null,"580 SERIES"]
[]
[{"$f":"A26","v":"Electrical"},null,5,null,{"$f":"C3/(C17+C15+C11+C9+C7+C5+C3+C13)","v":0.05}]
[]
[{"$f":"A37","v":"Supports & Foundations"},null,30,null,{"$f":"C5/(C17+C15+C11+C9+C7+C5+C3+C13)","v":0.3},null,null,null,"Support Type",null,null,null,null,"L8RD M4.9",null,null,"Single Pole ICA 3-Xarm",null,null,"Single Pole\nFixed xarms",null,null,"2 Pole 3-Xarm",null,null,"2 Single Pole 3-ICA, internal",null,null,"Single pole, 2-lattice xarm",null,null,"2 Single Pole 3-ICA, Ext",null,null,"2-pole, \n2-lattice xarm",null,null,"ICA 3-Xarm",null,null,"MISC, \nX lattice"]
[]
[{"$f":"A53","v":"Mechanical & Electrical"},null,10,null,{"$f":"C7/(C17+C15+C11+C9+C7+C5+C3+C13)","v":0.1}]
[null,null,null,null,null,null,null,null,"Conductor configuration",null,null,null,null,"Vertical",null,null,"Vertical",null,null,"Vertical",null,null,"Vertical",null,null,"Vertical",null,null,"Tri-form",null,null,"Vertical",null,null,"Tri-form",null,null,"Vertical",null,null,"Vertical"]
[{"$f":"A63","v":"Construction "},null,10,null,{"$f":"C9/(C17+C15+C11+C9+C7+C5+C3+C13)","v":0.1},null,null,null,"Nominal standard span (m)",null,null,null,null,305,null,null,200,null,null,200,null,null,200,null,null,200,null,null,200,null,null,200,null,null,200,null,null,300,null,null,200]
[]
[{"$f":"A81","v":"Maintenance"},null,5,null,{"$f":"C11/(C17+C15+C11+C9+C7+C5+C3+C13)","v":0.05}]
[]
[{"$f":"A91","v":"Operational Safety"},null,10,null,{"$f":"C13/(C3+C17+C13+C11+C9+C7+C5+C15)","v":0.1}]
[]
[{"$f":"A96","v":"Environmental"},null,30,null,{"$f":"C15/(C17+C15+C11+C9+C7+C5+C3+C13)","v":0.3}]
[]
[{"$f":"A109","v":"Other"},null,0,null,{"$f":"C17/(C17+C15+C11+C9+C7+C13+C5+C3)","v":0}]
[]
["[Adjust total MDA weightings to 100]",null,{"$f":"C3+C5+C7+C9+C11+C15+C17+C13","v":100},null,null,null,null,null,null,null,null,null,null,"L8RD M4.9",null,null,"510 SERIES",null,null,"510X SERIES",null,null,"520 SERIES",null,null,"530 SERIES",null,null,"540 SERIES",null,null,"550 SERIES",null,null,"560 SERIES",null,null,"570 SERIES",null,null,"580 SERIES"]
[null,null,null,null,null,null,null,null,null,null,null,null,null,"(BENCHMARK)"]
[]
[]
[null,null,"Totals",null,null,null,null,null,null,null,null,{"$f":"L36+L52+L62+L80+L90+L108+L115+L95","v":0.99999999999999989},null,{"$f":"(N36+N52+N62+N80+N90+N95+N108+N115)*10","v":56.085133536478786},null,null,{"$f":"(Q36+Q52+Q62+Q80+Q90+Q95+Q108+Q115)*10","v":56.219797605759226},null,null,{"$f":"(T36+T52+T62+T80+T90+T95+T108+T115)*10","v":65.373686823409827},null,null,{"$f":"(W36+W52+W62+W80+W90+W95+W108+W115)*10","v":55.850655887242304},null,null,{"$f":"(Z36+Z52+Z62+Z80+Z90+Z95+Z108+Z115)*10","v":49.245824309053603},null,null,{"$f":"(AC36+AC52+AC62+AC80+AC90+AC95+AC108+AC115)*10","v":54.4075706419803},null,null,{"$f":"(AF36+AF52+AF62+AF80+AF90+AF95+AF108+AF115)*10","v":51.075682919299723},null,null,{"$f":"(AI36+AI52+AI62+AI80+AI90+AI95+AI108+AI115)*10","v":47.127328444383423},null,null,{"$f":"(AL36+AL52+AL62+AL80+AL90+AL95+AL108+AL115)*10","v":44.535118348107275},null,null,{"$f":"(AO36+AO52+AO62+AO80+AO90+AO95+AO108+AO115)*10","v":34.646003502546634}]
[]
["Main Design Aspect (MDA)",null,"Design Aspect (DA)","Status (Prov/ comp)","Quant/ Qual",null,"MDA weighting (from top left)",null,"Sub DA adjust't","Sub DA weighting",null,"Overall weighting (%)",null,"Score","Weighted score",null,"Score","Weighted score",null,"Score","Weighted score",null,"Score","Weighted score",null,"Score","Weighted score",null,"Score","Weighted score",null,"Score","Weighted score",null,"Score","Weighted score",null,"Score","Weighted score",null,"Score","Weighted score"]
["Electrical","E.1","Audible Noise","Complete","Quant've",null,{"$f":"$E$3","v":0.05},null,100,{"$f":"I26/$I$36","v":0.36764705882352944},null,{"$f":"G26*J26","v":1.8382352941176471E-2},null,9,{"$f":"N26*$L26","v":0.16544117647058823},null,5,{"$f":"Q26*$L26","v":9.1911764705882359E-2},null,5,{"$f":"T26*$L26","v":9.1911764705882359E-2},null,6,{"$f":"W26*$L26","v":0.11029411764705882},null,1,{"$f":"Z26*$L26","v":1.8382352941176471E-2},null,7,{"$f":"AC26*$L26","v":0.12867647058823531},null,5,{"$f":"AF26*$L26","v":9.1911764705882359E-2},null,8,{"$f":"AI26*$L26","v":0.14705882352941177},null,8,{"$f":"AL26*$L26","v":0.14705882352941177},null,5,{"$f":"AO26*$L26","v":9.1911764705882359E-2},null,{"$f":"MIN(N26,Q26,W26,Z26,AC26,AF26,AI26,AL26,AO26)","v":1},{"$f":"MAX(N26,Q26,W26,Z26,AC26,AF26,AI26,AL26,AO26)","v":9},{"$f":"IF(AND(AR26=1,AS26=9),\"\",\"check\")","v":""}]
["Electrical","E.2","Magnetic Fields (external)","Complete","Quant've",null,0.05,null,48,{"$f":"I27/$I$36","v":0.17647058823529413},null,{"$f":"G27*J27","v":8.8235294117647075E-3},null,1,{"$f":"N27*$L27","v":8.8235294117647075E-3},null,5,4.4117647058823539E-2,null,5,4.4117647058823539E-2,null,4,3.529411764705883E-2,null,5,4.4117647058823539E-2,null,9,7.9411764705882362E-2,null,5,4.4117647058823539E-2,null,9,7.9411764705882362E-2,null,1,8.8235294117647075E-3,null,5,4.4117647058823539E-2,null,{"$f":"MIN(N27,Q27,W27,Z27,AC27,AF27,AI27,AL27,AO27)","v":1},{"$f":"MAX(N27,Q27,W27,Z27,AC27,AF27,AI27,AL27,AO27)","v":9},{"$f":"IF(AND(AR27=1,AS27=9),\"\",\"check\")","v":""}]
["Electrical","E.3","Electric Fields (external)","Complete","Quant've",null,0.05,null,44.000000000000007,0.16176470588235298,null,8.0882352941176495E-3,null,1,8.0882352941176495E-3,null,3,2.4264705882352949E-2,null,3,2.4264705882352949E-2,null,3,2.4264705882352949E-2,null,4,3.2352941176470598E-2,null,9,7.2794117647058842E-2,null,3,2.4264705882352949E-2,null,6,4.8529411764705897E-2,null,2,1.6176470588235299E-2,null,2,1.6176470588235299E-2,null,1,9,""]
["Electrical","E.4","Radio Interference","Complete","Quant've",null,0.05,null,40,0.14705882352941177,null,7.352941176470589E-3,null,9,6.6176470588235295E-2,null,5,3.6764705882352942E-2,null,5,3.6764705882352942E-2,null,6,4.4117647058823532E-2,null,1,7.352941176470589E-3,null,7,5.1470588235294122E-2,null,5,3.6764705882352942E-2,null,8,5.8823529411764712E-2,null,8,5.8823529411764712E-2,null,5,3.6764705882352942E-2,null,1,9,""]
["Electrical","E.5","Earthing Performance","Complete","Qual",null,0.05,null,0,0,null,0,null,7,0,null,3,0,null,3,0,null,9,0,null,1,0,null,3,0,null,2,0,null,8,0,null,7,0,null,6,0,null,1,9,""]
["Electrical","E.6","Lightning Performance","Complete","Quant've",null,0.05,null,0,0,null,0,null,1,0,null,9,0,null,9,0,null,5,0,null,7,0,null,6,0,null,3,0,null,5,0,null,6,0,null,5,0,null,1,9,""]
["Electrical","E.7","Insulation Coordination","Complete","Quant've",null,0.05,null,32,0.11764705882352941,null,5.8823529411764705E-3,null,5,2.9411764705882353E-2,null,5,2.9411764705882353E-2,null,5,2.9411764705882353E-2,null,5,2.9411764705882353E-2,null,5,2.9411764705882353E-2,null,5,2.9411764705882353E-2,null,5,2.9411764705882353E-2,null,5,2.9411764705882353E-2,null,5,2.9411764705882353E-2,null,5,2.9411764705882353E-2,null,5,5,"check"]
["Electrical","E.8","Surge Impedance Loading (SIL) ","Complete","Quant've",null,0.05,null,0,0,null,0,null,1,0,null,7,0,null,7,0,null,5,0,null,7,0,null,7,0,null,7,0,null,7,0,null,1,0,null,9,0,null,1,9,""]
["Electrical","E.9","Electric Fields within/near structure","Complete","Quant've",null,0.05,null,4,1.4705882352941176E-2,null,7.3529411764705881E-4,null,2,1.4705882352941176E-3,null,3,2.2058823529411764E-3,null,3,2.2058823529411764E-3,null,3,2.2058823529411764E-3,null,5,3.6764705882352941E-3,null,9,6.6176470588235293E-3,null,2,1.4705882352941176E-3,null,5,3.6764705882352941E-3,null,1,7.3529411764705881E-4,null,3,2.2058823529411764E-3,null,1,9,""]
["Electrical","E.10","Magnetic Fields within/ near structure","Complete","Quant've",null,0.05,null,4,1.4705882352941176E-2,null,7.3529411764705881E-4,null,4,2.9411764705882353E-3,null,6,4.4117647058823529E-3,null,6,4.4117647058823529E-3,null,5,3.6764705882352941E-3,null,7,5.1470588235294117E-3,null,1,7.3529411764705881E-4,null,7,5.1470588235294117E-3,null,1,7.3529411764705881E-4,null,4,2.9411764705882353E-3,null,9,6.6176470588235293E-3,null,1,9,""]
["Electrical Totals",null,null,null,null,null,null,null,{"$f":"SUM(I26:I35)","v":272},{"$f":"SUM(J26:J35)","v":1.0000000000000002},null,{"$f":"SUM(L26:L35)","v":4.9999999999999996E-2},null,{"$f":"SUM(O26:O35)","v":0.28235294117647058},null,null,{"$f":"SUM(R26:R35)","v":0.23308823529411768},null,null,{"$f":"SUM(U26:U35)","v":0.23308823529411768},null,null,{"$f":"SUM(X26:X35)","v":0.24926470588235294},null,null,{"$f":"SUM(AA26:AA35)","v":0.14044117647058826},null,null,{"$f":"SUM(AD26:AD35)","v":0.36911764705882355},null,null,{"$f":"SUM(AG26:AG35)","v":0.23308823529411768},null,null,{"$f":"SUM(AJ26:AJ35)","v":0.36764705882352944},null,null,{"$f":"SUM(AM26:AM35)","v":0.26397058823529412},null,null,{"$f":"SUM(AP26:AP35)","v":0.2272058823529412}]
["Supports & Foundations","S.1","Number of elements","Complete","Quant've",null,{"$f":"$E$5","v":0.3},null,50,{"$f":"I37/$I$52","v":0.12345679012345678},null,{"$f":"G37*J37","v":3.7037037037037035E-2},null,1,{"$f":"N37*$L37","v":3.7037037037037035E-2},null,8,{"$f":"Q37*$L37","v":0.29629629629629628},null,9,{"$f":"T37*$L37","v":0.33333333333333331},null,9,{"$f":"W37*$L37","v":0.33333333333333331},null,7,{"$f":"Z37*$L37","v":0.25925925925925924},null,8,{"$f":"AC37*$L37","v":0.29629629629629628},null,7,{"$f":"AF37*$L37","v":0.25925925925925924},null,5,{"$f":"AI37*$L37","v":0.18518518518518517},null,1,{"$f":"AL37*$L37","v":3.7037037037037035E-2},null,1,{"$f":"AO37*$L37","v":3.7037037037037035E-2},null,1,9,""]
["Supports & Foundations","S.2","Number of joints","Complete","Quant've",null,0.3,null,50,0.12345679012345678,null,{"$f":"G38*J38","v":3.7037037037037035E-2},null,1,{"$f":"N38*$L38","v":3.7037037037037035E-2},null,5,{"$f":"Q38*$L38","v":0.18518518518518517},null,6,{"$f":"T38*$L38","v":0.22222222222222221},null,9,{"$f":"W38*$L38","v":0.33333333333333331},null,4,{"$f":"Z38*$L38","v":0.14814814814814814},null,2,{"$f":"AC38*$L38","v":7.407407407407407E-2},null,4,{"$f":"AF38*$L38","v":0.14814814814814814},null,1,{"$f":"AI38*$L38","v":3.7037037037037035E-2},null,1,{"$f":"AL38*$L38","v":3.7037037037037035E-2},null,1,{"$f":"AO38*$L38","v":3.7037037037037035E-2},null,1,9,""]
["Supports & Foundations","S.3","Side slope added complexity","Complete","Quant've",null,0.3,null,25,6.1728395061728392E-2,null,{"$f":"G39*J39","v":1.8518518518518517E-2},null,6,{"$f":"N39*$L39","v":0.1111111111111111},null,9,{"$f":"Q39*$L39","v":0.16666666666666666},null,9,{"$f":"T39*$L39","v":0.16666666666666666},null,7,{"$f":"W39*$L39","v":0.12962962962962962},null,1,{"$f":"Z39*$L39","v":1.8518518518518517E-2},null,9,{"$f":"AC39*$L39","v":0.16666666666666666},null,7,{"$f":"AF39*$L39","v":0.12962962962962962},null,7,{"$f":"AI39*$L39","v":0.12962962962962962},null,5,{"$f":"AL39*$L39","v":9.2592592592592587E-2},null,5,{"$f":"AO39*$L39","v":9.2592592592592587E-2},null,1,9,""]
["Supports & Foundations","S.4","Weight of structure (per km)","Complete","Quant've",null,0.3,null,50,0.12345679012345678,null,{"$f":"G40*J40","v":3.7037037037037035E-2},null,8.6029789319520251,{"$f":"N40*$L40","v":0.31862884933155644},null,7,{"$f":"Q40*$L40","v":0.25925925925925924},null,6,{"$f":"T40*$L40","v":0.22222222222222221},null,1,{"$f":"W40*$L40","v":3.7037037037037035E-2},null,2.2234175196450825,{"$f":"Z40*$L40","v":8.2348797023891945E-2},null,4.9374836895061911,{"$f":"AC40*$L40","v":0.18286976627800708},null,2.2234175196450825,{"$f":"AF40*$L40","v":8.2348797023891945E-2},null,5.0383912778728215,{"$f":"AI40*$L40","v":0.18660708436566004},null,9,{"$f":"AL40*$L40","v":0.33333333333333331},null,8.8290370284455015,{"$f":"AO40*$L40","v":0.32700137142390745},null,1,9,""]
["Supports & Foundations","S.5","Suitability to use of alternative materials","Complete","Qual",null,0.3,null,35,8.6419753086419748E-2,null,2.5925925925925925E-2,null,2,5.185185185185185E-2,null,7,0.18148148148148147,null,7,0.18148148148148147,null,9,0.23333333333333334,null,8,0.2074074074074074,null,5,0.12962962962962962,null,8,0.2074074074074074,null,5,0.12962962962962962,null,2,5.185185185185185E-2,null,1,2.5925925925925925E-2,null,1,9,""]
["Supports & Foundations","S.6","Reduction in reliability in single circuit configuration (i.e. strung one side)","Complete","Quant've",null,0.3,null,15,3.7037037037037035E-2,null,1.111111111111111E-2,null,4.1333333333333329,4.5925925925925919E-2,null,4,4.4444444444444439E-2,null,4,4.4444444444444439E-2,null,4.0999999999999996,4.5555555555555544E-2,null,9,9.9999999999999992E-2,null,2.9666666666666659,3.2962962962962951E-2,null,9,9.9999999999999992E-2,null,1,1.111111111111111E-2,null,3.5,3.8888888888888883E-2,null,1.2333333333333343,1.3703703703703713E-2,null,1,9,""]
["Supports & Foundations","S.7","Ice accretion performance","Complete","Quant've",null,0.3,null,5,1.2345679012345678E-2,null,3.7037037037037034E-3,null,1.3496657880452247,4.998762177945276E-3,null,9,3.3333333333333333E-2,null,9,3.3333333333333333E-2,null,8.7789640017522643,3.2514681487971347E-2,null,7.3897417002956391,2.7369413704798663E-2,null,4.724486583543591,1.7498098457568854E-2,null,7.3897417002956391,2.7369413704798663E-2,null,5.3167654983773778,1.969172406806436E-2,null,3.4787535095487985,1.2884272257588142E-2,null,1,3.7037037037037034E-3,null,1,9,""]
["Supports & Foundations","S.8","Area for painting","Complete","Quant've",null,0.3,null,15,3.7037037037037035E-2,null,1.111111111111111E-2,null,1.3496657880452247,1.4996286533835829E-2,null,9,9.9999999999999992E-2,null,9,9.9999999999999992E-2,null,8.7789640017522643,9.7544044463914042E-2,null,7.3897417002956391,8.2108241114395977E-2,null,4.724486583543591,5.2494295372706563E-2,null,7.3897417002956391,8.2108241114395977E-2,null,5.3167654983773778,5.9075172204193081E-2,null,3.4787535095487985,3.8652816772764421E-2,null,1,1.111111111111111E-2,null,1,9,""]
["Supports & Foundations","S.9","Implications of addition of extensions","Complete","Quant've",null,0.3,null,5,1.2345679012345678E-2,null,3.7037037037037034E-3,null,5,1.8518518518518517E-2,null,9,3.3333333333333333E-2,null,9,3.3333333333333333E-2,null,8,2.9629629629629627E-2,null,8,2.9629629629629627E-2,null,9,3.3333333333333333E-2,null,8,2.9629629629629627E-2,null,8,2.9629629629629627E-2,null,5,1.8518518518518517E-2,null,1,3.7037037037037034E-3,null,1,9,""]
["Supports & Foundations","S.10","Length of load path","Complete","Quant've",null,0.3,null,5,1.2345679012345678E-2,null,3.7037037037037034E-3,null,5.8651779393783396,2.1722881256956813E-2,null,8,2.9629629629629627E-2,null,8,2.9629629629629627E-2,null,1.8494755132247849,6.8499093082399435E-3,null,8,2.9629629629629627E-2,null,4.0890018662719605,1.5144451356562815E-2,null,8,2.9629629629629627E-2,null,1,3.7037037037037034E-3,null,4,1.4814814814814814E-2,null,9,3.3333333333333333E-2,null,1,9,""]
["Supports & Foundations","S.11","Familiarity with Form (familiar forms score high)","Complete","Qual",null,0.3,null,50,0.12345679012345678,null,{"$f":"G47*J47","v":3.7037037037037035E-2},null,9,{"$f":"N47*$L47","v":0.33333333333333331},null,4,{"$f":"Q47*$L47","v":0.14814814814814814},null,6,{"$f":"T47*$L47","v":0.22222222222222221},null,5,{"$f":"W47*$L47","v":0.18518518518518517},null,4,{"$f":"Z47*$L47","v":0.14814814814814814},null,2,{"$f":"AC47*$L47","v":7.407407407407407E-2},null,4,{"$f":"AF47*$L47","v":0.14814814814814814},null,2,{"$f":"AI47*$L47","v":7.407407407407407E-2},null,8,{"$f":"AL47*$L47","v":0.29629629629629628},null,1,{"$f":"AO47*$L47","v":3.7037037037037035E-2},null,1,9,""]
["Supports & Foundations","S.12","Foundation complexity","Complete","Qual",null,0.3,null,20,4.9382716049382713E-2,null,{"$f":"G48*J48","v":1.4814814814814814E-2},null,9,{"$f":"N48*$L48","v":0.13333333333333333},null,4,{"$f":"Q48*$L48","v":5.9259259259259255E-2},null,4,{"$f":"T48*$L48","v":5.9259259259259255E-2},null,1,{"$f":"W48*$L48","v":1.4814814814814814E-2},null,4,{"$f":"Z48*$L48","v":5.9259259259259255E-2},null,4,{"$f":"AC48*$L48","v":5.9259259259259255E-2},null,1,{"$f":"AF48*$L48","v":1.4814814814814814E-2},null,1,{"$f":"AI48*$L48","v":1.4814814814814814E-2},null,9,{"$f":"AL48*$L48","v":0.13333333333333333},null,9,{"$f":"AO48*$L48","v":0.13333333333333333},null,1,9,""]
["Supports & Foundations","S.13","Foundations (Volume of concrete per km)","Complete","Quant've",null,0.3,null,50,0.12345679012345678,null,{"$f":"G49*J49","v":3.7037037037037035E-2},null,5.9711456592349661,{"$f":"N49*$L49","v":0.22115354293462836},null,8,{"$f":"Q49*$L49","v":0.29629629629629628},null,8,{"$f":"T49*$L49","v":0.29629629629629628},null,1,{"$f":"W49*$L49","v":3.7037037037037035E-2},null,3.0008199047649078,{"$f":"Z49*$L49","v":0.11114147795425584},null,9,{"$f":"AC49*$L49","v":0.33333333333333331},null,4.9948282930213495,{"$f":"AF49*$L49","v":0.18499364048227218},null,4.6550093027656025,{"$f":"AI49*$L49","v":0.17240775195428157},null,6.4844480884656237,{"$f":"AL49*$L49","v":0.2401647440172453},null,4.9746460218851523,{"$f":"AO49*$L49","v":0.18424614895870933},null,1,9,""]
["Supports & Foundations","S.14","Foundations (Volume of excavation per km)","Complete","Quant've",null,0.3,null,25,6.1728395061728392E-2,null,{"$f":"G50*J50","v":1.8518518518518517E-2},null,7.551546391752578,{"$f":"N50*$L50","v":0.1398434516991218},null,7,{"$f":"Q50*$L50","v":0.12962962962962962},null,7,{"$f":"T50*$L50","v":0.12962962962962962},null,2.6804123711340262,{"$f":"W50*$L50","v":4.9637266132111592E-2},null,1,{"$f":"Z50*$L50","v":1.8518518518518517E-2},null,8.7525773195876244,{"$f":"AC50*$L50","v":0.16208476517754858},null,7.2680412371133993,{"$f":"AF50*$L50","v":0.13459335624284072},null,9,{"$f":"AI50*$L50","v":0.16666666666666666},null,7.5704467353951905,{"$f":"AL50*$L50","v":0.14019345806287389},null,3.4922680412371148,{"$f":"AO50*$L50","v":6.4671630393279902E-2},null,1,9,""]
["Supports & Foundations","S.15","Suitability for application of two earthwires","Complete","Qual",null,0.3,null,5,{"$f":"I51/$I$52","v":1.2345679012345678E-2},null,{"$f":"G51*J51","v":3.7037037037037034E-3},null,1,{"$f":"N51*$L51","v":3.7037037037037034E-3},null,2,{"$f":"Q51*$L51","v":7.4074074074074068E-3},null,2,{"$f":"T51*$L51","v":7.4074074074074068E-3},null,9,{"$f":"W51*$L51","v":3.3333333333333333E-2},null,9,{"$f":"Z51*$L51","v":3.3333333333333333E-2},null,2,{"$f":"AC51*$L51","v":7.4074074074074068E-3},null,2,{"$f":"AF51*$L51","v":7.4074074074074068E-3},null,2,{"$f":"AI51*$L51","v":7.4074074074074068E-3},null,1,{"$f":"AL51*$L51","v":3.7037037037037034E-3},null,9,{"$f":"AO51*$L51","v":3.3333333333333333E-2},null,1,9,""]
["Supports & Foundations Totals",null,null,null,null,null,null,null,{"$f":"SUM(I37:I51)","v":405},{"$f":"SUM(J37:J51)","v":1.0000000000000002},null,{"$f":"SUM(L37:L51)","v":0.3},null,{"$f":"SUM(O37:O51)","v":1.4931956257858963},null,null,{"$f":"SUM(R37:R51)","v":1.9703703703703708},null,null,{"$f":"SUM(U37:U51)","v":2.0814814814814819},null,null,{"$f":"SUM(X37:X51)","v":1.5987681236144591},null,null,{"$f":"SUM(AA37:AA51)","v":1.3548197816491947},null,null,{"$f":"SUM(AD37:AD51)","v":1.6371284136794308},null,null,{"$f":"SUM(AG37:AG51)","v":1.5854875226422733},null,null,{"$f":"SUM(AJ37:AJ51)","v":1.2266706214810879},null,null,{"$f":"SUM(AM37:AM51)","v":1.4893026985178792},null,null,{"$f":"SUM(AP37:AP51)","v":1.0377710026277485}]
["Mechanical & Electrical","M.1","Insulation Mechanical Reliability","Complete","Qual",null,{"$f":"$E$7","v":0.1},null,20,{"$f":"I53/$I$62","v":5.2628809010052104E-2},null,{"$f":"G53*J53","v":5.2628809010052107E-3},null,1,{"$f":"N53*$L53","v":5.2628809010052107E-3},null,9,{"$f":"Q53*$L53","v":4.7365928109046898E-2},null,1,{"$f":"T53*$L53","v":5.2628809010052107E-3},null,9,{"$f":"W53*$L53","v":4.7365928109046898E-2},null,9,{"$f":"Z53*$L53","v":4.7365928109046898E-2},null,9,{"$f":"AC53*$L53","v":4.7365928109046898E-2},null,9,{"$f":"AF53*$L53","v":4.7365928109046898E-2},null,9,{"$f":"AI53*$L53","v":4.7365928109046898E-2},null,9,{"$f":"AL53*$L53","v":4.7365928109046898E-2},null,9,{"$f":"AO53*$L53","v":4.7365928109046898E-2},null,1,9,""]
["Mechanical & Electrical","M.2","Insulation Material Limitation","Complete","Qual",null,0.1,null,20,{"$f":"I54/$I$62","v":5.2628809010052104E-2},null,5.2628809010052107E-3,null,9,4.7365928109046898E-2,null,1,{"$f":"Q54*$L54","v":5.2628809010052107E-3},null,9,{"$f":"T54*$L54","v":4.7365928109046898E-2},null,9,{"$f":"W54*$L54","v":4.7365928109046898E-2},null,1,{"$f":"Z54*$L54","v":5.2628809010052107E-3},null,9,{"$f":"AC54*$L54","v":4.7365928109046898E-2},null,1,{"$f":"AF54*$L54","v":5.2628809010052107E-3},null,9,{"$f":"AI54*$L54","v":4.7365928109046898E-2},null,1,{"$f":"AL54*$L54","v":5.2628809010052107E-3},null,1,{"$f":"AO54*$L54","v":5.2628809010052107E-3},null,1,9,""]
["Mechanical & Electrical","M.3","Number of Insulators","Complete","Qual",null,0.1,null,100,0.26314404505026051,null,2.6314404505026052E-2,null,9,0.23682964054523448,null,1,{"$f":"Q55*$L55","v":2.6314404505026052E-2},null,9,{"$f":"T55*$L55","v":0.23682964054523448},null,1,{"$f":"W55*$L55","v":2.6314404505026052E-2},null,1,{"$f":"Z55*$L55","v":2.6314404505026052E-2},null,1,{"$f":"AC55*$L55","v":2.6314404505026052E-2},null,1,{"$f":"AF55*$L55","v":2.6314404505026052E-2},null,1,{"$f":"AI55*$L55","v":2.6314404505026052E-2},null,1,{"$f":"AL55*$L55","v":2.6314404505026052E-2},null,1,{"$f":"AO55*$L55","v":2.6314404505026052E-2},null,1,9,""]
["Mechanical & Electrical","M.4","Galloping (susceptibility to conductor clashing)","Complete","Qual",null,0.1,null,100,{"$f":"I56/$I$62","v":0.26314404505026051},null,2.6314404505026052E-2,null,7,0.18420083153518235,null,5,{"$f":"Q56*$L56","v":0.13157202252513026},null,5,{"$f":"T56*$L56","v":0.13157202252513026},null,5,{"$f":"W56*$L56","v":0.13157202252513026},null,5,{"$f":"Z56*$L56","v":0.13157202252513026},null,9,{"$f":"AC56*$L56","v":0.23682964054523448},null,5,{"$f":"AF56*$L56","v":0.13157202252513026},null,9,{"$f":"AI56*$L56","v":0.23682964054523448},null,1,{"$f":"AL56*$L56","v":2.6314404505026052E-2},null,6,{"$f":"AO56*$L56","v":0.15788642703015632},null,1,9,""]
["Mechanical & Electrical","M.5","Formation of Jumpers at Angle Supports","Complete","Qual",null,0.1,null,20,{"$f":"I57/$I$62","v":5.2628809010052104E-2},null,5.2628809010052107E-3,null,5,2.6314404505026055E-2,null,5,2.6314404505026055E-2,null,5,2.6314404505026055E-2,null,5,2.6314404505026055E-2,null,5,2.6314404505026055E-2,null,5,2.6314404505026055E-2,null,5,2.6314404505026055E-2,null,5,2.6314404505026055E-2,null,5,2.6314404505026055E-2,null,5,2.6314404505026055E-2,null,5,5,"check"]
["Mechanical & Electrical","M.6","Angle Support Insulation","Complete","Qual",null,0.1,null,100,{"$f":"I58/$I$62","v":0.26314404505026051},null,2.6314404505026052E-2,null,9,0.23682964054523448,null,1,2.6314404505026052E-2,null,5,0.13157202252513026,null,9,0.23682964054523448,null,5,0.13157202252513026,null,9,0.23682964054523448,null,5,0.13157202252513026,null,9,0.23682964054523448,null,1,2.6314404505026052E-2,null,1,2.6314404505026052E-2,null,1,9,""]
["Mechanical & Electrical","M.7","Type Testing Requirements","Complete","Qual",null,0.1,null,10,{"$f":"I59/$I$62","v":2.6314404505026052E-2},null,2.6314404505026054E-3,null,9,2.3682964054523449E-2,null,1,{"$f":"Q59*$L59","v":2.6314404505026054E-3},null,9,{"$f":"T59*$L59","v":2.3682964054523449E-2},null,9,{"$f":"W59*$L59","v":2.3682964054523449E-2},null,1,{"$f":"Z59*$L59","v":2.6314404505026054E-3},null,9,{"$f":"AC59*$L59","v":2.3682964054523449E-2},null,1,{"$f":"AF59*$L59","v":2.6314404505026054E-3},null,9,{"$f":"AI59*$L59","v":2.3682964054523449E-2},null,1,{"$f":"AL59*$L59","v":2.6314404505026054E-3},null,1,{"$f":"AO59*$L59","v":2.6314404505026054E-3},null,1,9,""]
["Mechanical & Electrical","M.8","Suitability for ICA adaption","Complete","Qual",null,0.1,null,10,{"$f":"I60/$I$62","v":2.6314404505026052E-2},null,2.6314404505026054E-3,null,5,1.3157202252513028E-2,null,9,{"$f":"Q60*$L60","v":2.3682964054523449E-2},null,3,{"$f":"T60*$L60","v":7.8943213515078152E-3},null,3,{"$f":"W60*$L60","v":7.8943213515078152E-3},null,9,{"$f":"Z60*$L60","v":2.3682964054523449E-2},null,1,{"$f":"AC60*$L60","v":2.6314404505026054E-3},null,9,{"$f":"AF60*$L60","v":2.3682964054523449E-2},null,1,{"$f":"AI60*$L60","v":2.6314404505026054E-3},null,9,{"$f":"AL60*$L60","v":2.3682964054523449E-2},null,9,{"$f":"AO60*$L60","v":2.3682964054523449E-2},null,1,9,""]
["Mechanical & Electrical","M.9","Familiarity with Attachment Arrangement","Complete","Qual",null,0.1,null,0.02,5.2628809010052104E-5,null,5.2628809010052111E-6,null,9,4.7365928109046896E-5,null,1,{"$f":"Q61*$L61","v":5.2628809010052111E-6},null,9,{"$f":"T61*$L61","v":4.7365928109046896E-5},null,9,{"$f":"W61*$L61","v":4.7365928109046896E-5},null,1,{"$f":"Z61*$L61","v":5.2628809010052111E-6},null,9,{"$f":"AC61*$L61","v":4.7365928109046896E-5},null,1,{"$f":"AF61*$L61","v":5.2628809010052111E-6},null,9,{"$f":"AI61*$L61","v":4.7365928109046896E-5},null,1,{"$f":"AL61*$L61","v":5.2628809010052111E-6},null,1,{"$f":"AO61*$L61","v":5.2628809010052111E-6},null,1,9,""]
["Mechanical & Electrical Totals",null,null,null,null,null,null,null,{"$f":"SUM(I53:I61)","v":380.02},{"$f":"SUM(J53:J61)","v":1.0000000000000002},null,{"$f":"SUM(L53:L61)","v":0.1},null,{"$f":"SUM(O53:O61)","v":0.77369085837587492},null,null,{"$f":"SUM(R53:R61)","v":0.28946371243618763},null,null,{"$f":"SUM(U53:U61)","v":0.61054155044471348},null,null,{"$f":"SUM(X53:X61)","v":0.54738697963265093},null,null,{"$f":"SUM(AA53:AA61)","v":0.39472133045629182},null,null,{"$f":"SUM(AD53:AD61)","v":0.64738171675174983},null,null,{"$f":"SUM(AG53:AG61)","v":0.39472133045629182},null,null,{"$f":"SUM(AJ53:AJ61)","v":0.64738171675174983},null,null,{"$f":"SUM(AM53:AM61)","v":0.18420609441608335},null,null,{"$f":"SUM(AP53:AP61)","v":0.31577811694121366}]
["Construction ","C.1","Support Supply Chain Familiarity","Complete","Qual",null,{"$f":"$E$9","v":0.1},null,11.111111111111111,{"$f":"I63/$I$80","v":1.3869625520110958E-2},null,{"$f":"G63*J63","v":1.386962552011096E-3},null,9,{"$f":"N63*$L63","v":1.2482662968099863E-2},null,3,{"$f":"Q63*$L63","v":4.1608876560332879E-3},null,3,{"$f":"T63*$L63","v":4.1608876560332879E-3},null,3,{"$f":"W63*$L63","v":4.1608876560332879E-3},null,3,{"$f":"Z63*$L63","v":4.1608876560332879E-3},null,1,{"$f":"AC63*$L63","v":1.386962552011096E-3},null,3,{"$f":"AF63*$L63","v":4.1608876560332879E-3},null,1,{"$f":"AI63*$L63","v":1.386962552011096E-3},null,9,{"$f":"AL63*$L63","v":1.2482662968099863E-2},null,9,{"$f":"AO63*$L63","v":1.2482662968099863E-2},null,1,9,""]
["Construction ","C.2","Insulation Supply Chain Familiarity (Composite)","Complete","Qual",null,0.1,null,11.111111111111111,1.3869625520110958E-2,null,{"$f":"G64*J64","v":1.386962552011096E-3},null,5,{"$f":"N64*$L64","v":6.9348127600554798E-3},null,5,{"$f":"Q64*$L64","v":6.9348127600554798E-3},null,5,{"$f":"T64*$L64","v":6.9348127600554798E-3},null,5,{"$f":"W64*$L64","v":6.9348127600554798E-3},null,5,{"$f":"Z64*$L64","v":6.9348127600554798E-3},null,5,{"$f":"AC64*$L64","v":6.9348127600554798E-3},null,5,{"$f":"AF64*$L64","v":6.9348127600554798E-3},null,5,{"$f":"AI64*$L64","v":6.9348127600554798E-3},null,5,{"$f":"AL64*$L64","v":6.9348127600554798E-3},null,5,6.9348127600554798E-3,null,5,5,"check","OK","510 1, L8RD 9"]
["Construction ","C.3","Support Type testing","Complete","Qual",null,0.1,null,22.222222222222221,2.7739251040221916E-2,null,{"$f":"G65*J65","v":2.7739251040221919E-3},null,5,{"$f":"N65*$L65","v":1.386962552011096E-2},null,5,{"$f":"Q65*$L65","v":1.386962552011096E-2},null,5,{"$f":"T65*$L65","v":1.386962552011096E-2},null,5,{"$f":"W65*$L65","v":1.386962552011096E-2},null,5,{"$f":"Z65*$L65","v":1.386962552011096E-2},null,5,{"$f":"AC65*$L65","v":1.386962552011096E-2},null,5,{"$f":"AF65*$L65","v":1.386962552011096E-2},null,5,{"$f":"AI65*$L65","v":1.386962552011096E-2},null,5,{"$f":"AL65*$L65","v":1.386962552011096E-2},null,5,1.386962552011096E-2,null,5,5,"check","ok","Differentiate"]
["Construction ","C.4","Support check erect","Complete","Qual",null,0.1,null,22.222222222222221,2.7739251040221916E-2,null,{"$f":"G66*J66","v":2.7739251040221919E-3},null,1,{"$f":"N66*$L66","v":2.7739251040221919E-3},null,9,{"$f":"Q66*$L66","v":2.4965325936199725E-2},null,9,{"$f":"T66*$L66","v":2.4965325936199725E-2},null,6,{"$f":"W66*$L66","v":1.6643550624133151E-2},null,8,{"$f":"Z66*$L66","v":2.2191400832177535E-2},null,6,{"$f":"AC66*$L66","v":1.6643550624133151E-2},null,8,{"$f":"AF66*$L66","v":2.2191400832177535E-2},null,6,{"$f":"AI66*$L66","v":1.6643550624133151E-2},null,1,{"$f":"AL66*$L66","v":2.7739251040221919E-3},null,1,2.7739251040221919E-3,null,1,9,""]
["Construction ","C.5","Complexity of support (Fabrication)","Complete","Qual",null,0.1,null,55.555555555555557,6.9348127600554796E-2,null,6.9348127600554798E-3,null,3,2.080443828016644E-2,null,9,6.241331484049932E-2,null,9,6.241331484049932E-2,null,7,4.8543689320388356E-2,null,8,5.5478502080443838E-2,null,6,4.160887656033288E-2,null,8,5.5478502080443838E-2,null,6,4.160887656033288E-2,null,3,2.080443828016644E-2,null,1,6.9348127600554798E-3,null,1,9,""]
["Construction ","C.6","Area required for Foundation Construction","Complete","Qual",null,0.1,null,27.777777777777779,3.4674063800277398E-2,null,{"$f":"G68*J68","v":3.4674063800277399E-3},null,1,{"$f":"N68*$L68","v":3.4674063800277399E-3},null,9,{"$f":"Q68*$L68","v":3.120665742024966E-2},null,9,{"$f":"T68*$L68","v":3.120665742024966E-2},null,3,{"$f":"W68*$L68","v":1.040221914008322E-2},null,2,{"$f":"Z68*$L68","v":6.9348127600554798E-3},null,9,{"$f":"AC68*$L68","v":3.120665742024966E-2},null,4,{"$f":"AF68*$L68","v":1.386962552011096E-2},null,3,{"$f":"AI68*$L68","v":1.040221914008322E-2},null,1,{"$f":"AL68*$L68","v":3.4674063800277399E-3},null,1,3.4674063800277399E-3,null,1,9,""]
["Construction ","C.7","Area required for Assembly & Erection","Complete","Qual",null,0.1,null,100,0.12482662968099861,null,{"$f":"G69*J69","v":1.2482662968099863E-2},null,1,{"$f":"N69*$L69","v":1.2482662968099863E-2},null,9,{"$f":"Q69*$L69","v":0.11234396671289876},null,9,{"$f":"T69*$L69","v":0.11234396671289876},null,7,{"$f":"W69*$L69","v":8.7378640776699046E-2},null,6,{"$f":"Z69*$L69","v":7.4895977808599176E-2},null,6,{"$f":"AC69*$L69","v":7.4895977808599176E-2},null,8,{"$f":"AF69*$L69","v":9.9861303744798902E-2},null,4,{"$f":"AI69*$L69","v":4.9930651872399451E-2},null,1,{"$f":"AL69*$L69","v":1.2482662968099863E-2},null,1,1.2482662968099863E-2,null,1,9,""]
["Construction ","C.8","Support Transport & Storage","Complete","Qual",null,0.1,null,100,0.12482662968099861,null,1.2482662968099863E-2,null,1,1.2482662968099863E-2,null,9,0.11234396671289876,null,9,0.11234396671289876,null,6,7.4895977808599176E-2,null,7,8.7378640776699046E-2,null,6,7.4895977808599176E-2,null,7,8.7378640776699046E-2,null,5,6.2413314840499313E-2,null,1,1.2482662968099863E-2,null,1,1.2482662968099863E-2,null,1,9,""]
["Construction ","C.9","Access Track Requirement","Complete","Qual",null,0.1,null,1.1111111111111112,1.3869625520110957E-3,null,1.3869625520110957E-4,null,1,1.3869625520110957E-4,null,9,1.2482662968099861E-3,null,9,1.2482662968099861E-3,null,9,1.2482662968099861E-3,null,9,1.2482662968099861E-3,null,9,1.2482662968099861E-3,null,9,1.2482662968099861E-3,null,9,1.2482662968099861E-3,null,1,1.3869625520110957E-4,null,1,1.3869625520110957E-4,null,1,9,""]
["Construction ","C.10","Ease of support assembly / erection","Complete","Qual",null,0.1,null,100,0.12482662968099861,null,1.2482662968099863E-2,null,2,2.4965325936199725E-2,null,9,0.11234396671289876,null,9,0.11234396671289876,null,7,8.7378640776699046E-2,null,8,9.9861303744798902E-2,null,7,8.7378640776699046E-2,null,8,9.9861303744798902E-2,null,6,7.4895977808599176E-2,null,2,2.4965325936199725E-2,null,1,1.2482662968099863E-2,null,1,9,""]
["Construction ","C.11","Support access/ egress/ rescue","Complete","Qual",null,0.1,null,100,0.12482662968099861,null,{"$f":"G73*J73","v":1.2482662968099863E-2},null,9,{"$f":"N73*$L73","v":0.11234396671289876},null,5,{"$f":"Q73*$L73","v":6.2413314840499313E-2},null,5,{"$f":"T73*$L73","v":6.2413314840499313E-2},null,7,{"$f":"W73*$L73","v":8.7378640776699046E-2},null,5,{"$f":"Z73*$L73","v":6.2413314840499313E-2},null,1,{"$f":"AC73*$L73","v":1.2482662968099863E-2},null,5,{"$f":"AF73*$L73","v":6.2413314840499313E-2},null,1,{"$f":"AI73*$L73","v":1.2482662968099863E-2},null,7,{"$f":"AL73*$L73","v":8.7378640776699046E-2},null,4,{"$f":"AO73*$L73","v":4.9930651872399451E-2},null,1,9,""]
["Construction ","C.12","Need for insulator temporary restraint","Complete","Qual",null,0.1,null,16.666666666666664,2.0804438280166433E-2,null,{"$f":"G74*J74","v":2.0804438280166435E-3},null,9,{"$f":"N74*$L74","v":1.8723994452149791E-2},null,1,{"$f":"Q74*$L74","v":2.0804438280166435E-3},null,9,{"$f":"T74*$L74","v":1.8723994452149791E-2},null,9,{"$f":"W74*$L74","v":1.8723994452149791E-2},null,1,{"$f":"Z74*$L74","v":2.0804438280166435E-3},null,9,{"$f":"AC74*$L74","v":1.8723994452149791E-2},null,1,{"$f":"AF74*$L74","v":2.0804438280166435E-3},null,9,{"$f":"AI74*$L74","v":1.8723994452149791E-2},null,1,{"$f":"AL74*$L74","v":2.0804438280166435E-3},null,1,{"$f":"AO74*$L74","v":2.0804438280166435E-3},null,1,9,""]
["Construction ","C.13","Conductor Installation Process","Complete","Qual",null,0.1,null,44.444444444444443,5.5478502080443831E-2,null,5.5478502080443838E-3,null,9,4.9930651872399451E-2,null,9,4.9930651872399451E-2,null,9,4.9930651872399451E-2,null,9,4.9930651872399451E-2,null,9,4.9930651872399451E-2,null,1,5.5478502080443838E-3,null,9,4.9930651872399451E-2,null,1,5.5478502080443838E-3,null,9,4.9930651872399451E-2,null,4,2.2191400832177535E-2,null,1,9,""]
["Construction ","C.14","Insulator Conductor Attachment Point","Complete","Qual",null,0.1,null,11.111111111111111,1.3869625520110958E-2,null,1.386962552011096E-3,null,9,1.2482662968099863E-2,null,3,4.1608876560332879E-3,null,9,1.2482662968099863E-2,null,7,9.7087378640776725E-3,null,3,4.1608876560332879E-3,null,1,1.386962552011096E-3,null,3,4.1608876560332879E-3,null,1,1.386962552011096E-3,null,3,4.1608876560332879E-3,null,1,1.386962552011096E-3,null,1,9,""]
["Construction ","C.15","Refurbishment inc. e/w- 1 cct live proximity","Complete","Qual",null,0.1,null,44.444444444444443,5.5478502080443831E-2,null,{"$f":"G77*J77","v":5.5478502080443838E-3},null,1,{"$f":"N77*$L77","v":5.5478502080443838E-3},null,7,3.883495145631069E-2,null,7,3.883495145631069E-2,null,9,4.9930651872399451E-2,null,3,1.6643550624133151E-2,null,7,3.883495145631069E-2,null,9,4.9930651872399451E-2,null,8,4.438280166435507E-2,null,9,4.9930651872399451E-2,null,9,{"$f":"AO77*$L77","v":4.9930651872399451E-2},null,1,9,""]
["Construction ","C.16","Route Dismantling","Complete","Qual",null,0.1,null,44.444444444444443,5.5478502080443831E-2,null,{"$f":"G78*J78","v":5.5478502080443838E-3},null,9,{"$f":"N78*$L78","v":4.9930651872399451E-2},null,5,2.7739251040221919E-2,null,5,2.7739251040221919E-2,null,1,5.5478502080443838E-3,null,3,1.6643550624133151E-2,null,3,1.6643550624133151E-2,null,3,1.6643550624133151E-2,null,1,5.5478502080443838E-3,null,9,4.9930651872399451E-2,null,9,{"$f":"AO78*$L78","v":4.9930651872399451E-2},null,1,9,""]
["Construction ","C.17","Tension Support (Conductor Installation)","Complete","Qual",null,0.1,null,88.888888888888886,0.11095700416088766,null,{"$f":"G79*J79","v":1.1095700416088768E-2},null,9,{"$f":"N79*$L79","v":9.9861303744798902E-2},null,4,4.438280166435507E-2,null,4,4.438280166435507E-2,null,9,9.9861303744798902E-2,null,4,4.438280166435507E-2,null,1,1.1095700416088768E-2,null,4,4.438280166435507E-2,null,1,1.1095700416088768E-2,null,1,1.1095700416088768E-2,null,1,{"$f":"AO79*$L79","v":1.1095700416088768E-2},null,1,9,""]
["Construction Totals",null,null,null,null,null,null,null,{"$f":"SUM(I63:I79)","v":801.11111111111109},{"$f":"SUM(J63:J79)","v":0.99999999999999978},null,{"$f":"SUM(L63:L79)","v":0.1},null,{"$f":"SUM(O63:O79)","v":0.45922330097087377},null,null,{"$f":"SUM(R63:R79)","v":0.71137309292649087},null,null,{"$f":"SUM(U63:U79)","v":0.73633841886269058},null,null,{"$f":"SUM(X63:X79)","v":0.67253814147018032},null,null,{"$f":"SUM(AA63:AA79)","v":0.56920943134535373},null,null,{"$f":"SUM(AD63:AD79)","v":0.45478502080443828},null,null,{"$f":"SUM(AG63:AG79)","v":0.6343966712898752},null,null,{"$f":"SUM(AJ63:AJ79)","v":0.37850208044382805},null,null,{"$f":"SUM(AM63:AM79)","v":0.36490984743411936},null,null,{"$f":"SUM(AP63:AP79)","v":0.27059639389736478}]
["Maintenance","R.1","Ancillary equipment (including third party)","Complete","Qual",null,{"$f":"$E$11","v":0.05},null,14.285714285714285,{"$f":"I81/$I$90","v":3.6363636363636362E-2},null,{"$f":"G81*J81","v":1.8181818181818182E-3},null,9,{"$f":"N81*$L81","v":1.6363636363636365E-2},null,1,{"$f":"Q81*$L81","v":1.8181818181818182E-3},null,1,{"$f":"T81*$L81","v":1.8181818181818182E-3},null,1,{"$f":"W81*$L81","v":1.8181818181818182E-3},null,1,{"$f":"Z81*$L81","v":1.8181818181818182E-3},null,1,{"$f":"AC81*$L81","v":1.8181818181818182E-3},null,1,{"$f":"AF81*$L81","v":1.8181818181818182E-3},null,1,{"$f":"AI81*$L81","v":1.8181818181818182E-3},null,9,{"$f":"AL81*$L81","v":1.6363636363636365E-2},null,9,{"$f":"AO81*$L81","v":1.6363636363636365E-2},null,1,9,""]
["Maintenance","R.2","Main Component Replacement","Complete","Qual",null,0.05,null,100,0.25454545454545457,null,1.2727272727272729E-2,null,9,0.11454545454545456,null,1,1.2727272727272729E-2,null,1,1.2727272727272729E-2,null,6,7.6363636363636384E-2,null,1,1.2727272727272729E-2,null,3,3.8181818181818192E-2,null,1,1.2727272727272729E-2,null,3,3.8181818181818192E-2,null,1,1.2727272727272729E-2,null,1,1.2727272727272729E-2,null,1,9,""]
["Maintenance","R.3","Suitability for operational activities (e.g. isolation)","Complete","Qual",null,0.05,null,28.571428571428569,7.2727272727272724E-2,null,3.6363636363636364E-3,null,9,3.272727272727273E-2,null,9,3.272727272727273E-2,null,9,3.272727272727273E-2,null,9,3.272727272727273E-2,null,9,3.272727272727273E-2,null,1,3.6363636363636364E-3,null,9,3.272727272727273E-2,null,1,3.6363636363636364E-3,null,9,3.272727272727273E-2,null,9,3.272727272727273E-2,null,1,9,""]
["Maintenance","R.4","Main Component Replacement to Earthwires","Complete","Qual",null,0.05,null,28.571428571428569,7.2727272727272724E-2,null,3.6363636363636364E-3,null,9,{"$f":"N84*$L84","v":3.272727272727273E-2},null,9,3.272727272727273E-2,null,9,3.272727272727273E-2,null,1,3.6363636363636364E-3,null,1,3.6363636363636364E-3,null,9,3.272727272727273E-2,null,1,3.6363636363636364E-3,null,1,3.6363636363636364E-3,null,9,3.272727272727273E-2,null,9,{"$f":"AO84*$L84","v":3.272727272727273E-2},null,1,9,""]
["Maintenance","R.5","Phase Conductor System Repairs - 1 cct live proximity","Complete","Qual",null,0.05,null,57.142857142857139,0.14545454545454545,null,7.2727272727272727E-3,null,6,{"$f":"N85*$L85","v":4.363636363636364E-2},null,5,3.6363636363636362E-2,null,6,4.363636363636364E-2,null,6,4.363636363636364E-2,null,1,7.2727272727272727E-3,null,5,3.6363636363636362E-2,null,8,5.8181818181818182E-2,null,9,6.545454545454546E-2,null,6,4.363636363636364E-2,null,9,{"$f":"AO85*$L85","v":6.545454545454546E-2},null,1,9,""]
["Maintenance","R.6","Earthwire Conductor System Repairs - 1cct live proximity","Complete","Qual",null,0.05,null,57.142857142857139,0.14545454545454545,null,7.2727272727272727E-3,null,1,7.2727272727272727E-3,null,4,2.9090909090909091E-2,null,6,4.363636363636364E-2,null,8,5.8181818181818182E-2,null,9,6.545454545454546E-2,null,6,4.363636363636364E-2,null,8,5.8181818181818182E-2,null,8,5.8181818181818182E-2,null,2,1.4545454545454545E-2,null,1,7.2727272727272727E-3,null,1,9,""]
["Maintenance","R.7","Surface Preparation & Treatment/ Deterioration Protection","Complete","Qual",null,0.05,null,35.714285714285715,9.0909090909090912E-2,null,4.5454545454545461E-3,null,9,4.0909090909090916E-2,null,1,4.5454545454545461E-3,null,1,4.5454545454545461E-3,null,1,4.5454545454545461E-3,null,6,2.7272727272727275E-2,null,1,4.5454545454545461E-3,null,6,2.7272727272727275E-2,null,1,4.5454545454545461E-3,null,9,4.0909090909090916E-2,null,6,2.7272727272727275E-2,null,1,9,""]
["Maintenance","R.8","Condition Assessment Remote (Ground/ Aerial)","Complete","Qual",null,0.05,null,57.142857142857139,0.14545454545454545,null,7.2727272727272727E-3,null,1,7.2727272727272727E-3,null,9,6.545454545454546E-2,null,9,6.545454545454546E-2,null,6,4.363636363636364E-2,null,9,6.545454545454546E-2,null,6,4.363636363636364E-2,null,9,6.545454545454546E-2,null,6,4.363636363636364E-2,null,1,7.2727272727272727E-3,null,1,7.2727272727272727E-3,null,1,9,""]
["Maintenance","R.9","Condition Assessment Intrusive (Climbing)","Complete","Qual",null,0.05,null,14.285714285714285,3.6363636363636362E-2,null,1.8181818181818182E-3,null,9,1.6363636363636365E-2,null,1,1.8181818181818182E-3,null,1,1.8181818181818182E-3,null,9,1.6363636363636365E-2,null,9,1.6363636363636365E-2,null,1,1.8181818181818182E-3,null,9,1.6363636363636365E-2,null,1,1.8181818181818182E-3,null,9,1.6363636363636365E-2,null,1,1.8181818181818182E-3,null,1,9,""]
["Maintenance Totals",null,null,null,null,null,null,null,{"$f":"SUM(I81:I89)","v":392.85714285714283},{"$f":"SUM(J81:J89)","v":1},null,{"$f":"SUM(L81:L89)","v":4.9999999999999996E-2},null,{"$f":"SUM(O81:O89)","v":0.31181818181818177},null,null,{"$f":"SUM(R81:R89)","v":0.21727272727272731},null,null,{"$f":"SUM(U81:U89)","v":0.23909090909090913},null,null,{"$f":"SUM(X81:X89)","v":0.28090909090909089},null,null,{"$f":"SUM(AA81:AA89)","v":0.23272727272727275},null,null,{"$f":"SUM(AD81:AD89)","v":0.20636363636363639},null,null,{"$f":"SUM(AG81:AG89)","v":0.27636363636363637},null,null,{"$f":"SUM(AJ81:AJ89)","v":0.22090909090909094},null,null,{"$f":"SUM(AM81:AM89)","v":0.21727272727272728},null,null,{"$f":"SUM(AP81:AP89)","v":0.20363636363636367}]
["Operational Safety","O.1","Access/ Egress/ Rescue","Complete","Qual",null,{"$f":"$E$13","v":0.1},null,100,{"$f":"I91/$I$95","v":0.4},null,{"$f":"G91*J91","v":4.0000000000000008E-2},null,9,{"$f":"N91*$L91","v":0.3600000000000001},null,4,{"$f":"Q91*$L91","v":0.16000000000000003},null,5,{"$f":"T91*$L91","v":0.20000000000000004},null,7,{"$f":"W91*$L91","v":0.28000000000000003},null,5,{"$f":"Z91*$L91","v":0.20000000000000004},null,1,{"$f":"AC91*$L91","v":4.0000000000000008E-2},null,5,{"$f":"AF91*$L91","v":0.20000000000000004},null,1,{"$f":"AI91*$L91","v":4.0000000000000008E-2},null,7,{"$f":"AL91*$L91","v":0.28000000000000003},null,4,{"$f":"AO91*$L91","v":0.16000000000000003},null,{"$f":"MIN(N91,Q91,W91,Z91,AC91,AF91,AI91,AL91,AO91)","v":1},{"$f":"MAX(N91,Q91,W91,Z91,AC91,AF91,AI91,AL91,AO91)","v":9},{"$f":"IF(AND(AR91=1,AS91=9),\"\",\"check\")","v":""}]
["Operational Safety","O.2","Live line working","Complete","Qual",null,{"$f":"$E$13","v":0.1},null,57.142857142857139,{"$f":"I92/$I$95","v":0.22857142857142856},null,2.2857142857142857E-2,null,5,0.11428571428571428,null,5,0.11428571428571428,null,5,0.11428571428571428,null,5,{"$f":"W92*$L92","v":0.11428571428571428},null,5,0.11428571428571428,null,5,0.11428571428571428,null,5,0.11428571428571428,null,5,0.11428571428571428,null,5,0.11428571428571428,null,5,0.11428571428571428,null,5,5,"check"]
["Operational Safety","O.3","Management of Induced voltages / currents / Application of additional earthing","Complete","Qual",null,{"$f":"$E$13","v":0.1},null,57.142857142857139,{"$f":"I93/$I$95","v":0.22857142857142856},null,{"$f":"G93*J93","v":2.2857142857142857E-2},null,9,0.20571428571428571,null,1,2.2857142857142857E-2,null,9,0.20571428571428571,null,9,{"$f":"W93*$L93","v":0.20571428571428571},null,1,2.2857142857142857E-2,null,9,0.20571428571428571,null,1,2.2857142857142857E-2,null,9,0.20571428571428571,null,1,2.2857142857142857E-2,null,1,{"$f":"AO93*$L93","v":2.2857142857142857E-2},null,1,9,""]
["Operational Safety","O.4","Circuit Demarcation","Complete","Qual",null,{"$f":"$E$13","v":0.1},null,35.714285714285715,{"$f":"I94/$I$95","v":0.14285714285714285},null,{"$f":"G94*J94","v":1.4285714285714285E-2},null,9,0.12857142857142856,null,1,1.4285714285714285E-2,null,1,1.4285714285714285E-2,null,9,0.12857142857142856,null,9,0.12857142857142856,null,1,1.4285714285714285E-2,null,9,0.12857142857142856,null,9,0.12857142857142856,null,9,0.12857142857142856,null,9,{"$f":"AO94*$L94","v":0.12857142857142856},null,1,9,""]
["Operational Safety Totals",null,null,null,null,null,null,null,{"$f":"SUM(I91:I94)","v":250},{"$f":"SUM(J91:J94)","v":1},null,{"$f":"SUM(L91:L94)","v":0.1},null,{"$f":"SUM(O91:O94)","v":0.80857142857142861},null,null,{"$f":"SUM(R91:R94)","v":0.31142857142857144},null,null,{"$f":"SUM(U91:U94)","v":0.53428571428571425},null,null,{"$f":"SUM(X91:X94)","v":0.72857142857142854},null,null,{"$f":"SUM(AA91:AA94)","v":0.46571428571428575},null,null,{"$f":"SUM(AD91:AD94)","v":0.37428571428571428},null,null,{"$f":"SUM(AG91:AG94)","v":0.46571428571428575},null,null,{"$f":"SUM(AJ91:AJ94)","v":0.48857142857142855},null,null,{"$f":"SUM(AM91:AM94)","v":0.54571428571428571},null,null,{"$f":"SUM(AP91:AP94)","v":0.42571428571428571}]
["Environmental","P.1","Height","Complete","Quant've",null,{"$f":"$E$15","v":0.3},null,25,{"$f":"I96/$I$108","v":4.2372881355932202E-2},null,{"$f":"G96*J96","v":1.271186440677966E-2},null,1,{"$f":"N96*$L96","v":1.271186440677966E-2},null,6,{"$f":"Q96*$L96","v":7.6271186440677957E-2},null,6,{"$f":"T96*$L96","v":7.6271186440677957E-2},null,6,{"$f":"W96*$L96","v":7.6271186440677957E-2},null,6,{"$f":"Z96*$L96","v":7.6271186440677957E-2},null,9,{"$f":"AC96*$L96","v":0.11440677966101694},null,6,{"$f":"AF96*$L96","v":7.6271186440677957E-2},null,9,{"$f":"AI96*$L96","v":0.11440677966101694},null,1,{"$f":"AL96*$L96","v":1.271186440677966E-2},null,8,{"$f":"AO96*$L96","v":0.10169491525423728},null,1,9,""]
["Environmental","P.2","Supports per km","Complete","Quant've",null,0.3,null,50,8.4745762711864403E-2,null,2.542372881355932E-2,null,9,0.22881355932203387,null,1,2.542372881355932E-2,null,1,2.542372881355932E-2,null,1,2.542372881355932E-2,null,1,{"$f":"Z97*$L97","v":2.542372881355932E-2},null,1,2.542372881355932E-2,null,1,2.542372881355932E-2,null,1,2.542372881355932E-2,null,9,0.22881355932203387,null,1,2.542372881355932E-2,null,1,9,""]
["Environmental","P.3","Insulator Visual Impact","Complete","Qual",null,0.3,null,25,4.2372881355932202E-2,null,1.271186440677966E-2,null,9,0.11440677966101694,null,1,1.271186440677966E-2,null,9,0.11440677966101694,null,3,3.8135593220338979E-2,null,1,{"$f":"Z98*$L98","v":1.271186440677966E-2},null,3,3.8135593220338979E-2,null,1,1.271186440677966E-2,null,3,3.8135593220338979E-2,null,1,1.271186440677966E-2,null,1,1.271186440677966E-2,null,1,9,""]
["Environmental","P.4","Transparency (Back clothing)","Complete","Qual",null,0.3,null,35,5.9322033898305086E-2,null,1.7796610169491526E-2,null,9,0.16016949152542373,null,5,8.8983050847457626E-2,null,5,8.8983050847457626E-2,null,1,1.7796610169491526E-2,null,3,5.3389830508474581E-2,null,4,7.1186440677966104E-2,null,3,5.3389830508474581E-2,null,3,5.3389830508474581E-2,null,9,0.16016949152542373,null,9,0.16016949152542373,null,1,9,""]
["Environmental","P.5","Conductor Arrangement (Compact/ Open)","Complete","Qual",null,0.3,null,25,4.2372881355932202E-2,null,1.271186440677966E-2,null,9,0.11440677966101694,null,7,8.8983050847457626E-2,null,7,8.8983050847457626E-2,null,7,8.8983050847457626E-2,null,7,8.8983050847457626E-2,null,1,1.271186440677966E-2,null,7,8.8983050847457626E-2,null,1,1.271186440677966E-2,null,9,0.11440677966101694,null,7,8.8983050847457626E-2,null,1,9,""]
["Environmental","P.6","Support  shape (eiffelised/ top heavy etc.)","Complete","Qual",null,0.3,null,30,5.0847457627118647E-2,null,1.5254237288135594E-2,null,7,0.10677966101694916,null,9,0.13728813559322034,null,8,0.12203389830508475,null,7,0.10677966101694916,null,9,0.13728813559322034,null,7,0.10677966101694916,null,9,0.13728813559322034,null,7,0.10677966101694916,null,5,7.6271186440677971E-2,null,1,1.5254237288135594E-2,null,1,9,""]
["Environmental","P.7","Cross arms","Complete","Qual",null,0.3,null,30,5.0847457627118647E-2,null,{"$f":"G102*J102","v":1.5254237288135594E-2},null,7,{"$f":"N102*$L102","v":0.10677966101694916},null,3,4.576271186440678E-2,null,9,0.13728813559322034,null,4,6.1016949152542375E-2,null,3,4.576271186440678E-2,null,4,6.1016949152542375E-2,null,3,4.576271186440678E-2,null,4,6.1016949152542375E-2,null,1,1.5254237288135594E-2,null,7,{"$f":"AO102*$L102","v":0.10677966101694916},null,1,7,"check"]
["Environmental","P.8","Design aesthetics","Complete","Qual",null,0.3,null,100,0.16949152542372881,null,{"$f":"G103*J103","v":5.084745762711864E-2},null,3,{"$f":"N103*$L103","v":0.15254237288135591},null,8,0.40677966101694912,null,9,0.45762711864406774,null,3,0.15254237288135591,null,7,0.3559322033898305,null,7,0.3559322033898305,null,6,0.30508474576271183,null,4,0.20338983050847456,null,1,5.084745762711864E-2,null,2,{"$f":"AO103*$L103","v":0.10169491525423728},null,1,8,"check"]
["Environmental","P.9","Corridor Width","Complete","Quant've",null,0.3,null,80,0.13559322033898305,null,{"$f":"G104*J104","v":4.0677966101694912E-2},null,6,{"$f":"N104*$L104","v":0.24406779661016947},null,7,{"$f":"Q104*$L104","v":0.28474576271186436},null,6,{"$f":"T104*$L104","v":0.24406779661016947},null,7,{"$f":"W104*$L104","v":0.28474576271186436},null,9,{"$f":"Z104*$L104","v":0.36610169491525424},null,3,{"$f":"AC104*$L104","v":0.12203389830508474},null,6,{"$f":"AF104*$L104","v":0.24406779661016947},null,1,{"$f":"AI104*$L104","v":4.0677966101694912E-2},null,6,{"$f":"AL104*$L104","v":0.24406779661016947},null,3,{"$f":"AO104*$L104","v":0.12203389830508474},null,1,9,""]
["Environmental","P.10","As Built Footprint","Complete","Quant've",null,0.3,null,80,0.13559322033898305,null,4.0677966101694912E-2,null,2,{"$f":"N105*$L105","v":8.1355932203389825E-2},null,9,{"$f":"Q105*$L105","v":0.36610169491525424},null,9,{"$f":"T105*$L105","v":0.36610169491525424},null,8,{"$f":"W105*$L105","v":0.3254237288135593},null,8,{"$f":"Z105*$L105","v":0.3254237288135593},null,9,{"$f":"AC105*$L105","v":0.36610169491525424},null,8,{"$f":"AF105*$L105","v":0.3254237288135593},null,8,{"$f":"AI105*$L105","v":0.3254237288135593},null,3,{"$f":"AL105*$L105","v":0.12203389830508474},null,1,4.0677966101694912E-2,null,1,9,""]
["Environmental","P.11","Effect on Birds","Complete","Semi-quant",null,0.3,null,60,0.10169491525423729,null,3.0508474576271188E-2,null,1,3.0508474576271188E-2,null,5,{"$f":"Q106*$L106","v":0.15254237288135594},null,5,{"$f":"T106*$L106","v":0.15254237288135594},null,5,{"$f":"W106*$L106","v":0.15254237288135594},null,5,{"$f":"Z106*$L106","v":0.15254237288135594},null,9,{"$f":"AC106*$L106","v":0.27457627118644068},null,5,{"$f":"AF106*$L106","v":0.15254237288135594},null,9,{"$f":"AI106*$L106","v":0.27457627118644068},null,4,{"$f":"AL106*$L106","v":0.12203389830508475},null,6,0.18305084745762712,null,1,9,""]
["Environmental","P.12","Tension Support Continuity","Complete","Qual",null,0.3,null,50,8.4745762711864403E-2,null,2.542372881355932E-2,null,5,0.1271186440677966,null,8,{"$f":"Q107*$L107","v":0.20338983050847456},null,9,{"$f":"T107*$L107","v":0.22881355932203387},null,7,{"$f":"W107*$L107","v":0.17796610169491525},null,5,{"$f":"Z107*$L107","v":0.1271186440677966},null,8,{"$f":"AC107*$L107","v":0.20338983050847456},null,2,{"$f":"AF107*$L107","v":5.084745762711864E-2},null,5,{"$f":"AI107*$L107","v":0.1271186440677966},null,9,{"$f":"AL107*$L107","v":0.22881355932203387},null,1,2.542372881355932E-2,null,1,9,""]
["Environmental Totals",null,null,null,null,null,null,null,{"$f":"SUM(I96:I107)","v":590},{"$f":"SUM(J96:J107)","v":1},null,{"$f":"SUM(L96:L107)","v":0.3},null,{"$f":"SUM(O96:O107)","v":1.4796610169491524},null,null,{"$f":"SUM(R96:R107)","v":1.8889830508474574},null,null,{"$f":"SUM(U96:U107)","v":2.1025423728813557},null,null,{"$f":"SUM(X96:X107)","v":1.5076271186440677},null,null,{"$f":"SUM(AA96:AA107)","v":1.7669491525423728},null,null,{"$f":"SUM(AD96:AD107)","v":1.7516949152542369},null,null,{"$f":"SUM(AG96:AG107)","v":1.5177966101694915},null,null,{"$f":"SUM(AJ96:AJ107)","v":1.3830508474576271},null,null,{"$f":"SUM(AM96:AM107)","v":1.3881355932203392},null,null,{"$f":"SUM(AP96:AP107)","v":0.98389830508474574}]
["Other","T.1","Susceptibility to damage (vandalism/accident)","Provisional","Qual",null,{"$f":"$E$17","v":0},null,33.333333333333329,{"$f":"I109/$I$115","v":0.1388850309713619},null,{"$f":"G109*J109","v":0},null,1,{"$f":"N109*$L109","v":0},null,9,{"$f":"Q109*$L109","v":0},null,9,{"$f":"T109*$L109","v":0},null,7,{"$f":"W109*$L109","v":0},null,9,{"$f":"Z109*$L109","v":0},null,9,{"$f":"AC109*$L109","v":0},null,9,{"$f":"AF109*$L109","v":0},null,9,{"$f":"AI109*$L109","v":0},null,1,{"$f":"AL109*$L109","v":0},null,1,{"$f":"AO109*$L109","v":0},null,1,9,""]
["Other","T.2","Resistance of materials to deterioration/attack","Provisional","Qual",null,0,null,33.333333333333329,{"$f":"I110/$I$115","v":0.1388850309713619},null,0,null,5,0,null,5,0,null,5,0,null,5,0,null,5,0,null,5,0,null,5,0,null,5,0,null,5,0,null,5,0,null,5,5,"check","ok"]
["Other","T.3","Number of supports per km of OHL","Provisional","Quant've",null,0,null,6.666666666666667,{"$f":"I111/$I$115","v":2.7777006194272386E-2},null,0,null,9,{"$f":"N111*$L111","v":0},null,1,0,null,1,0,null,1,0,null,1,0,null,1,0,null,1,0,null,1,0,null,9,0,null,1,0,null,1,9,""]
["Other","T.4","Embodied energy (embodied carbon)","Provisional","Quant've",null,0,null,6.6666666666666671E-3,{"$f":"I112/$I$115","v":2.7777006194272388E-5},null,0,null,9,{"$f":"N112*$L112","v":0},null,1,0,null,1,0,null,1,0,null,1,0,null,1,0,null,1,0,null,1,0,null,9,0,null,9,0,null,1,9,""]
["Other","T.5","Cost of supports (per km)","Provisional","Quant've",null,0,null,100,0.41665509291408576,null,0,null,9,{"$f":"N113*$L113","v":0},null,6,{"$f":"Q113*$L113","v":0},null,6,{"$f":"T113*$L113","v":0},null,1,{"$f":"W113*$L113","v":0},null,2,{"$f":"Z113*$L113","v":0},null,5,{"$f":"AC113*$L113","v":0},null,2,{"$f":"AF113*$L113","v":0},null,5,{"$f":"AI113*$L113","v":0},null,9,{"$f":"AL113*$L113","v":0},null,9,{"$f":"AO113*$L113","v":0},null,1,9,""]
["Other","T.6","Side slope - effect on height","Provisional","Quant've",null,0,null,66.666666666666657,{"$f":"I114/$I$115","v":0.2777700619427238},null,0,null,4,0,null,7,0,null,7,0,null,7,0,null,9,0,null,3,0,null,6,0,null,1,0,null,6,0,null,6,0,null,1,9,""]
["Other Totals",null,null,null,null,null,null,null,{"$f":"SUM(I109:I114)","v":240.00666666666663},{"$f":"SUM(J109:J114)","v":1},null,{"$f":"SUM(L109:L114)","v":0},null,{"$f":"SUM(O109:O114)","v":0},null,null,{"$f":"SUM(R109:R114)","v":0},null,null,{"$f":"SUM(U109:U114)","v":0},null,null,{"$f":"SUM(X109:X114)","v":0},null,null,{"$f":"SUM(AA109:AA114)","v":0},null,null,{"$f":"SUM(AD109:AD114)","v":0},null,null,{"$f":"SUM(AG109:AG114)","v":0},null,null,{"$f":"SUM(AJ109:AJ114)","v":0},null,null,{"$f":"SUM(AM109:AM114)","v":0},null,null,{"$f":"SUM(AP109:AP114)","v":0}]
[]
[]
[]
["Provisional"]
["Complete"]
[]
["Quant've"]
["Semi-quant"]
["Qual"]
[]
[]
[]
[]
[]
[]
[null,null,null,null,null,null,null,null,null,null,null,null,null,null,null,null,null,null,null,null,null,null,null,null,null,null,null,null,null,null,null,null,null,null,null,null,null,null,null,null,null,null,null,null,"Max","Min"]
[null,null,null,null,null,null,null,null,{"$f":"A3","v":"Electrical"},null,null,null,null,null,{"$f":"N$36*10","v":2.8235294117647056},null,null,{"$f":"Q$36*10","v":2.3308823529411766},null,null,null,null,null,{"$f":"W$36*10","v":2.4926470588235294},null,null,{"$f":"Z$36*10","v":1.4044117647058827},null,null,{"$f":"AC$36*10","v":3.6911764705882355},null,null,{"$f":"AF$36*10","v":2.3308823529411766},null,null,{"$f":"AI$36*10","v":3.6764705882352944},null,null,{"$f":"AL$36*10","v":2.6397058823529411},null,null,{"$f":"AO$36*10","v":2.2720588235294121},null,null,{"$f":"MAX(O132,R132,X132,AA132,AD132,AG132,AJ132,AM132,AP132)","v":3.6911764705882355},{"$f":"MIN(O132,R132,X132,AA132,AD132,AG132,AJ132,AM132,AP132)","v":1.4044117647058827}]
[null,null,null,null,null,null,null,null,{"$f":"A5","v":"Supports & Foundations"},null,null,null,null,null,{"$f":"N$52*10","v":14.931956257858962},null,null,{"$f":"Q$52*10","v":19.703703703703709},null,null,null,null,null,{"$f":"W$52*10","v":15.98768123614459},null,null,{"$f":"Z$52*10","v":13.548197816491946},null,null,{"$f":"AC$52*10","v":16.371284136794308},null,null,{"$f":"AF$52*10","v":15.854875226422733},null,null,{"$f":"AI$52*10","v":12.266706214810878},null,null,{"$f":"AL$52*10","v":14.893026985178793},null,null,{"$f":"AO$52*10","v":10.377710026277484},null,null,19.703703703703709,10.377710026277484]
[null,null,null,null,null,null,null,null,{"$f":"A7","v":"Mechanical & Electrical"},null,null,null,null,null,{"$f":"N62*10","v":7.7369085837587495},null,null,{"$f":"Q62*10","v":2.8946371243618763},null,null,null,null,null,{"$f":"W62*10","v":5.4738697963265093},null,null,{"$f":"Z62*10","v":3.9472133045629181},null,null,{"$f":"AC62*10","v":6.473817167517498},null,null,{"$f":"AF62*10","v":3.9472133045629181},null,null,{"$f":"AI62*10","v":6.473817167517498},null,null,{"$f":"AL62*10","v":1.8420609441608335},null,null,{"$f":"AO62*10","v":3.1577811694121367},null,null,7.7369085837587495,1.8420609441608335]
[null,null,null,null,null,null,null,null,{"$f":"A9","v":"Construction "},null,null,null,null,null,{"$f":"N80*10","v":4.592233009708738},null,null,{"$f":"Q80*10","v":7.1137309292649089},null,null,null,null,null,{"$f":"W80*10","v":6.7253814147018032},null,null,{"$f":"Z80*10","v":5.6920943134535378},null,null,{"$f":"AC80*10","v":4.547850208044383},null,null,{"$f":"AF80*10","v":6.3439667128987516},null,null,{"$f":"AI80*10","v":3.7850208044382807},null,null,{"$f":"AL80*10","v":3.6490984743411934},null,null,{"$f":"AO80*10","v":2.7059639389736478},null,null,7.1137309292649089,2.7059639389736478]
[null,null,null,null,null,null,null,null,{"$f":"A11","v":"Maintenance"},null,null,null,null,null,{"$f":"N90*10","v":3.1181818181818177},null,null,{"$f":"Q90*10","v":2.1727272727272733},null,null,null,null,null,{"$f":"W90*10","v":2.8090909090909086},null,null,{"$f":"Z90*10","v":2.3272727272727276},null,null,{"$f":"AC90*10","v":2.0636363636363639},null,null,{"$f":"AF90*10","v":2.7636363636363637},null,null,{"$f":"AI90*10","v":2.2090909090909094},null,null,{"$f":"AL90*10","v":2.1727272727272728},null,null,{"$f":"AO90*10","v":2.0363636363636366},null,null,3.1181818181818177,2.0363636363636366]
[null,null,null,null,null,null,null,null,{"$f":"A13","v":"Operational Safety"},null,null,null,null,null,{"$f":"N95*10","v":8.0857142857142854},null,null,{"$f":"Q95*10","v":3.1142857142857143},null,null,null,null,null,{"$f":"W95*10","v":7.2857142857142856},null,null,{"$f":"Z95*10","v":4.6571428571428575},null,null,{"$f":"AC95*10","v":3.7428571428571429},null,null,{"$f":"AF95*10","v":4.6571428571428575},null,null,{"$f":"AI95*10","v":4.8857142857142852},null,null,{"$f":"AL95*10","v":5.4571428571428573},null,null,{"$f":"AO95*10","v":4.2571428571428571},null,null,8.0857142857142854,3.1142857142857143]
[null,null,null,null,null,null,null,null,{"$f":"A15","v":"Environmental"},null,null,null,null,null,{"$f":"N108*10","v":14.796610169491524},null,null,{"$f":"Q108*10","v":18.889830508474574},null,null,null,null,null,{"$f":"W108*10","v":15.076271186440678},null,null,{"$f":"Z108*10","v":17.66949152542373},null,null,{"$f":"AC108*10","v":17.51694915254237},null,null,{"$f":"AF108*10","v":15.177966101694915},null,null,{"$f":"AI108*10","v":13.83050847457627},null,null,{"$f":"AL108*10","v":13.881355932203391},null,null,{"$f":"AO108*10","v":9.8389830508474567},null,null,18.889830508474574,9.8389830508474567]
[null,null,null,null,null,null,null,null,{"$f":"A17","v":"Other"},null,null,null,null,null,{"$f":"N115*10","v":0},null,null,{"$f":"Q115*10","v":0},null,null,null,null,null,{"$f":"W115*10","v":0},null,null,{"$f":"Z115*10","v":0},null,null,{"$f":"AC115*10","v":0},null,null,{"$f":"AF115*10","v":0},null,null,{"$f":"AI115*10","v":0},null,null,{"$f":"AL115*10","v":0},null,null,{"$f":"AO115*10","v":0},null,null,0,0]
[]
[null,null,null,null,null,null,null,null,null,null,null,null,null,null,{"$f":"SUM(O132:O139)","v":56.085133536478786},null,null,{"$f":"SUM(R132:R139)","v":56.219797605759233},null,null,null,null,null,{"$f":"SUM(X132:X139)","v":55.850655887242304},null,null,{"$f":"SUM(AA132:AA139)","v":49.245824309053603},null,null,{"$f":"SUM(AD132:AD139)","v":54.4075706419803},null,null,{"$f":"SUM(AG132:AG139)","v":51.075682919299716},null,null,{"$f":"SUM(AJ132:AJ139)","v":47.127328444383416},null,null,{"$f":"SUM(AM132:AM139)","v":44.535118348107282},null,null,{"$f":"SUM(AP132:AP139)","v":34.646003502546634}]
[]
["Main Design Aspect summaries"]
[null,null,{"$f":"A26","v":"Electrical"},null,null,null,null,null,null,null,null,null,null,{"$f":"N36","v":0.28235294117647058},null,null,{"$f":"Q36","v":0.23308823529411768},null,null,{"$f":"T36","v":0.23308823529411768},null,null,{"$f":"W36","v":0.24926470588235294},null,null,{"$f":"Z36","v":0.14044117647058826},null,null,{"$f":"AC36","v":0.36911764705882355},null,null,{"$f":"AF36","v":0.23308823529411768},null,null,{"$f":"AI36","v":0.36764705882352944},null,null,{"$f":"AL36","v":0.26397058823529412},null,null,{"$f":"AO36","v":0.2272058823529412}]
[null,null,{"$f":"A37","v":"Supports & Foundations"},null,null,null,null,null,null,null,null,null,null,{"$f":"N52","v":1.4931956257858963},null,null,{"$f":"Q52","v":1.9703703703703708},null,null,{"$f":"T52","v":2.0814814814814819},null,null,{"$f":"W52","v":1.5987681236144591},null,null,{"$f":"Z52","v":1.3548197816491947},null,null,{"$f":"AC52","v":1.6371284136794308},null,null,{"$f":"AF52","v":1.5854875226422733},null,null,{"$f":"AI52","v":1.2266706214810879},null,null,{"$f":"AL52","v":1.4893026985178792},null,null,{"$f":"AO52","v":1.0377710026277485}]
[null,null,{"$f":"A53","v":"Mechanical & Electrical"},null,null,null,null,null,null,null,null,null,null,{"$f":"N62","v":0.77369085837587492},null,null,{"$f":"Q62","v":0.28946371243618763},null,null,{"$f":"T62","v":0.61054155044471348},null,null,{"$f":"W62","v":0.54738697963265093},null,null,{"$f":"Z62","v":0.39472133045629182},null,null,{"$f":"AC62","v":0.64738171675174983},null,null,{"$f":"AF62","v":0.39472133045629182},null,null,{"$f":"AI62","v":0.64738171675174983},null,null,{"$f":"AL62","v":0.18420609441608335},null,null,{"$f":"AO62","v":0.31577811694121366}]
[null,null,{"$f":"A63","v":"Construction "},null,null,null,null,null,null,null,null,null,null,{"$f":"N80","v":0.45922330097087377},null,null,{"$f":"Q80","v":0.71137309292649087},null,null,{"$f":"T80","v":0.73633841886269058},null,null,{"$f":"W80","v":0.67253814147018032},null,null,{"$f":"Z80","v":0.56920943134535373},null,null,{"$f":"AC80","v":0.45478502080443828},null,null,{"$f":"AF80","v":0.6343966712898752},null,null,{"$f":"AI80","v":0.37850208044382805},null,null,{"$f":"AL80","v":0.36490984743411936},null,null,{"$f":"AO80","v":0.27059639389736478}]
[null,null,{"$f":"A81","v":"Maintenance"},null,null,null,null,null,null,null,null,null,null,{"$f":"N90","v":0.31181818181818177},null,null,{"$f":"Q90","v":0.21727272727272731},null,null,{"$f":"T90","v":0.23909090909090913},null,null,{"$f":"W90","v":0.28090909090909089},null,null,{"$f":"Z90","v":0.23272727272727275},null,null,{"$f":"AC90","v":0.20636363636363639},null,null,{"$f":"AF90","v":0.27636363636363637},null,null,{"$f":"AI90","v":0.22090909090909094},null,null,{"$f":"AL90","v":0.21727272727272728},null,null,{"$f":"AO90","v":0.20363636363636367}]
[null,null,{"$f":"A91","v":"Operational Safety"},null,null,null,null,null,null,null,null,null,null,{"$f":"N95","v":0.80857142857142861},null,null,{"$f":"Q95","v":0.31142857142857144},null,null,{"$f":"T95","v":0.53428571428571425},null,null,{"$f":"W95","v":0.72857142857142854},null,null,{"$f":"Z95","v":0.46571428571428575},null,null,{"$f":"AC95","v":0.37428571428571428},null,null,{"$f":"AF95","v":0.46571428571428575},null,null,{"$f":"AI95","v":0.48857142857142855},null,null,{"$f":"AL95","v":0.54571428571428571},null,null,{"$f":"AO95","v":0.42571428571428571}]
[null,null,{"$f":"A96","v":"Environmental"},null,null,null,null,null,null,null,null,null,null,{"$f":"N108","v":1.4796610169491524},null,null,{"$f":"Q108","v":1.8889830508474574},null,null,{"$f":"T108","v":2.1025423728813557},null,null,{"$f":"W108","v":1.5076271186440677},null,null,{"$f":"Z108","v":1.7669491525423728},null,null,{"$f":"AC108","v":1.7516949152542369},null,null,{"$f":"AF108","v":1.5177966101694915},null,null,{"$f":"AI108","v":1.3830508474576271},null,null,{"$f":"AL108","v":1.3881355932203392},null,null,{"$f":"AO108","v":0.98389830508474574}]
[null,null,{"$f":"A109","v":"Other"},null,null,null,null,null,null,null,null,null,null,{"$f":"N115","v":0},null,null,{"$f":"Q115","v":0},null,null,{"$f":"T115","v":0},null,null,{"$f":"W115","v":0},null,null,{"$f":"Z115","v":0},null,null,{"$f":"AC115","v":0},null,null,{"$f":"AF115","v":0},null,null,{"$f":"AI115","v":0},null,null,{"$f":"AL115","v":0},null,null,{"$f":"AO115","v":0}]
[]
["Relative changes in ratings compared to Benchmark support (L8RD M4.9)"]
[]
[null,null,null,null,null,null,null,null,null,null,null,null,null,null,"L8RD",null,{"$f":"Q1","v":"510 SERIES"},null,null,{"$f":"T1","v":"510X SERIES"},null,null,{"$f":"W1","v":"520 SERIES"},null,null,{"$f":"Z1","v":"530 SERIES"},null,null,{"$f":"AC1","v":"540 SERIES"},null,null,{"$f":"AF1","v":"550 SERIES"},null,null,{"$f":"AI1","v":"560 SERIES"},null,null,{"$f":"AL1","v":"570 SERIES"},null,null,{"$f":"AO1","v":"580 SERIES"}]
[null,null,null,null,null,null,null,null,null,null,null,null,null,"MDA","Rating",null,"Rating","% Diff",null,"Rating","% Diff",null,"Rating","% Diff",null,"Rating","% Diff",null,"Rating","% Diff",null,"Rating","% Diff",null,"Rating","% Diff",null,"Rating","% Diff",null,"Rating","% Diff"]
[null,null,null,null,null,null,null,null,null,null,null,null,null,"Elect",{"$f":"N36*10","v":2.8235294117647056},null,{"$f":"Q36*10","v":2.3308823529411766},{"$f":"IF(Q157-$O$164=0,\"NoChange\",(Q157-$O157)/$O157*100)","v":-17.447916666666654},null,{"$f":"T36*10","v":2.3308823529411766},{"$f":"IF(T157-$O$164=0,\"NoChange\",(T157-$O157)/$O157*100)","v":-17.447916666666654},null,{"$f":"W36*10","v":2.4926470588235294},{"$f":"IF(W157-$O$164=0,\"NoChange\",(W157-$O157)/$O157*100)","v":-11.718749999999991},null,{"$f":"Z36*10","v":1.4044117647058827},{"$f":"IF(Z157-$O$164=0,\"NoChange\",(Z157-$O157)/$O157*100)","v":-50.26041666666665},null,{"$f":"AC36*10","v":3.6911764705882355},{"$f":"IF(AC157-$O$164=0,\"NoChange\",(AC157-$O157)/$O157*100)","v":30.729166666666686},null,{"$f":"AF36*10","v":2.3308823529411766},{"$f":"IF(AF157-$O$164=0,\"NoChange\",(AF157-$O157)/$O157*100)","v":-17.447916666666654},null,{"$f":"AI36*10","v":3.6764705882352944},{"$f":"IF(AI157-$O$164=0,\"NoChange\",(AI157-$O157)/$O157*100)","v":30.208333333333353},null,{"$f":"AL36*10","v":2.6397058823529411},{"$f":"IF(AL157-$O$164=0,\"NoChange\",(AL157-$O157)/$O157*100)","v":-6.5104166666666599},null,{"$f":"AO36*10","v":2.2720588235294121},{"$f":"IF(AO157-$O$164=0,\"NoChange\",(AO157-$O157)/$O157*100)","v":-19.531249999999982}]
[null,null,null,null,null,null,null,null,null,null,null,null,null,"Struct&F",{"$f":"N52*10","v":14.931956257858962},null,{"$f":"Q52*10","v":19.703703703703709},31.956612807067991,null,{"$f":"T52*10","v":20.81481481481482},39.397775183406409,null,{"$f":"W52*10","v":15.98768123614459},7.0702388893617396,null,{"$f":"Z52*10","v":13.548197816491946},-9.2670941266568381,null,{"$f":"AC52*10","v":16.371284136794308},9.6392452139538101,null,{"$f":"AF52*10","v":15.854875226422733},6.1808309147572107,null,{"$f":"AI52*10","v":12.266706214810878},-17.849302509477379,null,{"$f":"AL52*10","v":14.893026985178793},-0.26071113528530704,null,{"$f":"AO52*10","v":10.377710026277484},-30.499997139922609]
[null,null,null,null,null,null,null,null,null,null,null,null,null,"Mech&El",{"$f":"N62*10","v":7.7369085837587495},null,{"$f":"Q62*10","v":2.8946371243618763},-62.586644355107502,null,{"$f":"T62*10","v":6.1054155044471345},-21.087144324497135,null,{"$f":"W62*10","v":5.4738697963265093},-29.249909869463771,null,{"$f":"Z62*10","v":3.9472133045629181},-48.982035113496444,null,{"$f":"AC62*10","v":6.473817167517498},-16.325531089933282,null,{"$f":"AF62*10","v":3.9472133045629181},-48.982035113496444,null,{"$f":"AI62*10","v":6.473817167517498},-16.325531089933282,null,{"$f":"AL62*10","v":1.8420609441608335},-76.191253596718582,null,{"$f":"AO62*10","v":3.1577811694121367},-59.185492044704738]
[null,null,null,null,null,null,null,null,null,null,null,null,null,"Constr",{"$f":"N80*10","v":4.592233009708738},null,{"$f":"Q80*10","v":7.1137309292649089},54.907882814859533,null,{"$f":"T80*10","v":7.363384188626906},60.34430685593474,null,{"$f":"W80*10","v":6.7253814147018032},46.451223195409241,null,{"$f":"Z80*10","v":5.6920943134535378},23.950468136514665,null,{"$f":"AC80*10","v":4.547850208044383},-0.96647538508003572,null,{"$f":"AF80*10","v":6.3439667128987516},38.145575354877671,null,{"$f":"AI80*10","v":3.7850208044382807},-17.57777106614315,null,{"$f":"AL80*10","v":3.6490984743411934},-20.537601932950761,null,{"$f":"AO80*10","v":2.7059639389736478},-41.075203865901535]
[null,null,null,null,null,null,null,null,null,null,null,null,null,"Maint",{"$f":"N90*10","v":3.1181818181818177},null,{"$f":"Q90*10","v":2.1727272727272733},-30.320699708454786,null,{"$f":"T90*10","v":2.3909090909090915},-23.323615160349824,null,{"$f":"W90*10","v":2.8090909090909086},-9.9125364431486886,null,{"$f":"Z90*10","v":2.3272727272727276},-25.364431486880445,null,{"$f":"AC90*10","v":2.0636363636363639},-33.819241982507272,null,{"$f":"AF90*10","v":2.7636363636363637},-11.37026239067054,null,{"$f":"AI90*10","v":2.2090909090909094},-29.154518950437296,null,{"$f":"AL90*10","v":2.1727272727272728},-30.320699708454796,null,{"$f":"AO90*10","v":2.0363636363636366},-34.693877551020393]
[null,null,null,null,null,null,null,null,null,null,null,null,null,"OperSafety",{"$f":"N95*10","v":8.0857142857142854},null,{"$f":"Q95*10","v":3.1142857142857143},-61.484098939929332,null,{"$f":"T95*10","v":5.3428571428571425},-33.922261484098939,null,{"$f":"W95*10","v":7.2857142857142856},-9.8939929328621883,null,{"$f":"Z95*10","v":4.6571428571428575},-42.402826855123671,null,{"$f":"AC95*10","v":3.7428571428571429},-53.710247349823312,null,{"$f":"AF95*10","v":4.6571428571428575},-42.402826855123671,null,{"$f":"AI95*10","v":4.8857142857142852},-39.575971731448767,null,{"$f":"AL95*10","v":5.4571428571428573},-32.508833922261481,null,{"$f":"AO95*10","v":4.2571428571428571},-47.349823321554766]
[null,null,null,null,null,null,null,null,null,null,null,null,null,"Env",{"$f":"N108*10","v":14.796610169491524},null,{"$f":"Q108*10","v":18.889830508474574},{"$f":"IF(Q163-$O$164=0,\"NoChange\",(Q163-$O163)/$O163*100)","v":27.663230240549826},null,{"$f":"T108*10","v":21.025423728813557},{"$f":"IF(T163-$O$164=0,\"NoChange\",(T163-$O163)/$O163*100)","v":42.09621993127147},null,{"$f":"W108*10","v":15.076271186440678},{"$f":"IF(W163-$O$164=0,\"NoChange\",(W163-$O163)/$O163*100)","v":1.8900343642611788},null,{"$f":"Z108*10","v":17.66949152542373},{"$f":"IF(Z163-$O$164=0,\"NoChange\",(Z163-$O163)/$O163*100)","v":19.415807560137477},null,{"$f":"AC108*10","v":17.51694915254237},{"$f":"IF(AC163-$O$164=0,\"NoChange\",(AC163-$O163)/$O163*100)","v":18.384879725085902},null,{"$f":"AF108*10","v":15.177966101694915},{"$f":"IF(AF163-$O$164=0,\"NoChange\",(AF163-$O163)/$O163*100)","v":2.5773195876288741},null,{"$f":"AI108*10","v":13.83050847457627},{"$f":"IF(AI163-$O$164=0,\"NoChange\",(AI163-$O163)/$O163*100)","v":-6.5292096219931288},null,{"$f":"AL108*10","v":13.881355932203391},{"$f":"IF(AL163-$O$164=0,\"NoChange\",(AL163-$O163)/$O163*100)","v":-6.1855670103092626},null,{"$f":"AO108*10","v":9.8389830508474567},{"$f":"IF(AO163-$O$164=0,\"NoChange\",(AO163-$O163)/$O163*100)","v":-33.505154639175259}]
[null,null,null,null,null,null,null,null,null,null,null,null,null,"Other",{"$f":"N115*10","v":0},null,{"$f":"Q115*10","v":0},{"$f":"IF(Q164-$O$164=0,\"NoChange\",(Q164-$O164)/$O164*100)","v":"NoChange"},null,{"$f":"T115*10","v":0},{"$f":"IF(T164-$O$164=0,\"NoChange\",(T164-$O164)/$O164*100)","v":"NoChange"},null,{"$f":"W115*10","v":0},{"$f":"IF(W164-$O$164=0,\"NoChange\",(W164-$O164)/$O164*100)","v":"NoChange"},null,{"$f":"Z115*10","v":0},{"$f":"IF(Z164-$O$164=0,\"NoChange\",(Z164-$O164)/$O164*100)","v":"NoChange"},null,{"$f":"AC115*10","v":0},{"$f":"IF(AC164-$O$164=0,\"NoChange\",(AC164-$O164)/$O164*100)","v":"NoChange"},null,{"$f":"AF115*10","v":0},{"$f":"IF(AF164-$O$164=0,\"NoChange\",(AF164-$O164)/$O164*100)","v":"NoChange"},null,{"$f":"AI115*10","v":0},{"$f":"IF(AI164-$O$164=0,\"NoChange\",(AI164-$O164)/$O164*100)","v":"NoChange"},null,{"$f":"AL115*10","v":0},{"$f":"IF(AL164-$O$164=0,\"NoChange\",(AL164-$O164)/$O164*100)","v":"NoChange"},null,{"$f":"AO115*10","v":0},{"$f":"IF(AO164-$O$164=0,\"NoChange\",(AO164-$O164)/$O164*100)","v":"NoChange"}]
[]
[null,null,null,null,null,null,null,null,null,null,null,null,null,"Overall",{"$f":"N23","v":56.085133536478786},null,{"$f":"Q23","v":56.219797605759226},{"$f":"IF(Q166-O166=0,\"NoChange\",(Q166-$O166)/$O166*100)","v":0.24010653231814452},null,{"$f":"T23","v":65.373686823409827},{"$f":"IF(T166-R166=0,\"NoChange\",(T166-$O166)/$O166*100)","v":16.561524777131176},null,{"$f":"W23","v":55.850655887242304},{"$f":"IF(W166-Q166=0,\"NoChange\",(W166-$O166)/$O166*100)","v":-0.41807451360345427},null,{"$f":"Z23","v":49.245824309053603},{"$f":"IF(Z166-W166=0,\"NoChange\",(Z166-$O166)/$O166*100)","v":-12.194513583491377},null,{"$f":"AC23","v":54.4075706419803},{"$f":"IF(AC166-Z166=0,\"NoChange\",(AC166-$O166)/$O166*100)","v":-2.9911008296117698},null,{"$f":"AF23","v":51.075682919299723},{"$f":"IF(AF166-AC166=0,\"NoChange\",(AF166-$O166)/$O166*100)","v":-8.9318689308652992},null,{"$f":"AI23","v":47.127328444383423},{"$f":"IF(AI166-AF166=0,\"NoChange\",(AI166-$O166)/$O166*100)","v":-15.971799525571326},null,{"$f":"AL23","v":44.535118348107275},{"$f":"IF(AL166-AI166=0,\"NoChange\",(AL166-$O166)/$O166*100)","v":-20.593719690190575},null,{"$f":"AO23","v":34.646003502546634},{"$f":"IF(AO166-AL166=0,\"NoChange\",(AO166-$O166)/$O166*100)","v":-38.226047941898464}]
[]
["Relative ratings compared to highest overall rated Short-List support"]
[]
[null,null,null,null,null,null,null,null,null,null,null,null,null,null,"Max SL",null,{"$f":"Q25","v":"Score"},null,null,{"$f":"T25","v":"Score"},null,null,{"$f":"W25","v":"Score"},null,null,{"$f":"Z25","v":"Score"},null,null,{"$f":"AC25","v":"Score"},null,null,{"$f":"AF25","v":"Score"},null,null,{"$f":"AI25","v":"Score"},null,null,{"$f":"AL25","v":"Score"},null,null,{"$f":"AO25","v":"Score"}]
[null,null,null,null,null,null,null,null,null,null,null,null,null,"MDA","Rating",null,"Rating","% Diff",null,null,null,null,"Rating","% Diff",null,"Rating","% Diff",null,"Rating","% Diff",null,"Rating","% Diff",null,"Rating","% Diff",null,"Rating","% Diff",null,"Rating","% Diff"]
[null,null,null,null,null,null,null,null,null,null,null,null,null,"Electrical",{"$f":"VLOOKUP(N172,ShortListRatings,$O$184,FALSE)","v":2.3308823529411766},null,{"$f":"Q36*10","v":2.3308823529411766},{"$f":"IF(Q172-O172=0,0,(Q172-$O172)/$O172*100)","v":0},null,{"$f":"T36*10","v":2.3308823529411766},{"$f":"IF(T172-R172=0,0,(T172-$O172)/$O172*100)","v":0},null,{"$f":"W36*10","v":2.4926470588235294},{"$f":"IF(W172-Q172=0,0,(W172-$O172)/$O172*100)","v":6.940063091482644},null,{"$f":"Z36*10","v":1.4044117647058827},{"$f":"IF(Z172-W172=0,0,(Z172-$O172)/$O172*100)","v":-39.747634069400625},null,{"$f":"AC36*10","v":3.6911764705882355},{"$f":"IF(AC172-Z172=0,0,(AC172-$O172)/$O172*100)","v":58.359621451104104},null,{"$f":"AF36*10","v":2.3308823529411766},{"$f":"IF(AF172-AC172=0,0,(AF172-$O172)/$O172*100)","v":0},null,{"$f":"AI36*10","v":3.6764705882352944},{"$f":"IF(AI172-AF172=0,0,(AI172-$O172)/$O172*100)","v":57.728706624605678},null,{"$f":"AL36*10","v":2.6397058823529411},{"$f":"IF(AL172-AI172=0,0,(AL172-$O172)/$O172*100)","v":13.249211356466867},null,{"$f":"AO36*10","v":2.2720588235294121},{"$f":"IF(AO172-AL172=0,0,(AO172-$O172)/$O172*100)","v":-2.5236593059936818}]
[null,null,null,null,null,null,null,null,null,null,null,null,null,"S&F",19.703703703703709,null,{"$f":"Q52*10","v":19.703703703703709},{"$f":"IF(Q173-O173=0,0,(Q173-$O173)/$O173)","v":0},null,{"$f":"T52*10","v":20.81481481481482},{"$f":"IF(T173-R173=0,0,(T173-$O173)/$O173)","v":5.6390977443608985E-2},null,{"$f":"W52*10","v":15.98768123614459},{"$f":"IF(W173-Q173=0,0,(W173-$O173)/$O173*100)","v":-18.859512523326352},null,{"$f":"Z52*10","v":13.548197816491946},{"$f":"IF(Z173-W173=0,0,(Z173-$O173)/$O173*100)","v":-31.24034942757849},null,{"$f":"AC52*10","v":16.371284136794308},{"$f":"IF(AC173-Z173=0,0,(AC173-$O173)/$O173*100)","v":-16.912655696720638},null,{"$f":"AF52*10","v":15.854875226422733},{"$f":"IF(AF173-AC173=0,0,(AF173-$O173)/$O173*100)","v":-19.53352798620044},null,{"$f":"AI52*10","v":12.266706214810878},{"$f":"IF(AI173-AF173=0,0,(AI173-$O173)/$O173*100)","v":-37.74416018798992},null,{"$f":"AL52*10","v":14.893026985178793},{"$f":"IF(AL173-AI173=0,0,(AL173-$O173)/$O173*100)","v":-24.415088609055022},null,{"$f":"AO52*10","v":10.377710026277484},{"$f":"IF(AO173-AL173=0,0,(AO173-$O173)/$O173*100)","v":-47.331170919268423}]
[null,null,null,null,null,null,null,null,null,null,null,null,null,"M&E",2.8946371243618763,null,{"$f":"Q62*10","v":2.8946371243618763},0,null,{"$f":"T62*10","v":6.1054155044471345},1.109216196069162,null,{"$f":"W62*10","v":5.4738697963265093},89.103834475736775,null,{"$f":"Z62*10","v":3.9472133045629181},36.362975218632378,null,{"$f":"AC62*10","v":6.473817167517498},123.6486609334375,null,{"$f":"AF62*10","v":3.9472133045629181},36.362975218632378,null,{"$f":"AI62*10","v":6.473817167517498},123.6486609334375,null,{"$f":"AL62*10","v":1.8420609441608335},-36.362975218632407,null,{"$f":"AO62*10","v":3.1577811694121367},9.0907438046580946]
[null,null,null,null,null,null,null,null,null,null,null,null,null,"Constr",7.1137309292649089,null,{"$f":"Q80*10","v":7.1137309292649089},0,null,{"$f":"T80*10","v":7.363384188626906},3.50945603431468E-2,null,{"$f":"W80*10","v":6.7253814147018032},-5.459153831156156,null,{"$f":"Z80*10","v":5.6920943134535378},-19.984402417625244,null,{"$f":"AC80*10","v":4.547850208044383},-36.069409241567548,null,{"$f":"AF80*10","v":6.3439667128987516},-10.820822772470258,null,{"$f":"AI80*10","v":3.7850208044382807},-46.792747124195735,null,{"$f":"AL80*10","v":3.6490984743411934},-48.703450965100394,null,{"$f":"AO80*10","v":2.7059639389736478},-61.961395983622538]
[null,null,null,null,null,null,null,null,null,null,null,null,null,"Maint",2.1727272727272733,null,{"$f":"Q90*10","v":2.1727272727272733},0,null,{"$f":"T90*10","v":2.3909090909090915},0.10041841004184102,null,{"$f":"W90*10","v":2.8090909090909086},29.28870292887024,null,{"$f":"Z90*10","v":2.3272727272727276},7.1129707112970593,null,{"$f":"AC90*10","v":2.0636363636363639},-5.0209205020920606,null,{"$f":"AF90*10","v":2.7636363636363637},27.196652719665241,null,{"$f":"AI90*10","v":2.2090909090909094},1.6736401673640064,null,{"$f":"AL90*10","v":2.1727272727272728},-2.0439252336195344E-14,null,{"$f":"AO90*10","v":2.0363636363636366},-6.2761506276150767]
[null,null,null,null,null,null,null,null,null,null,null,null,null,"OpSafety",3.1142857142857143,null,{"$f":"Q95*10","v":3.1142857142857143},0,null,{"$f":"T95*10","v":5.3428571428571425},0.71559633027522918,null,{"$f":"W95*10","v":7.2857142857142856},133.94495412844034,null,{"$f":"Z95*10","v":4.6571428571428575},49.541284403669735,null,{"$f":"AC95*10","v":3.7428571428571429},20.183486238532108,null,{"$f":"AF95*10","v":4.6571428571428575},49.541284403669735,null,{"$f":"AI95*10","v":4.8857142857142852},56.880733944954109,null,{"$f":"AL95*10","v":5.4571428571428573},75.22935779816514,null,{"$f":"AO95*10","v":4.2571428571428571},36.697247706422012]
[null,null,null,null,null,null,null,null,null,null,null,null,null,"Env",18.889830508474574,null,{"$f":"Q108*10","v":18.889830508474574},0,null,{"$f":"T108*10","v":21.025423728813557},0.11305518169582772,null,{"$f":"W108*10","v":15.076271186440678},-20.188425302826371,null,{"$f":"Z108*10","v":17.66949152542373},-6.4602960969044245,null,{"$f":"AC108*10","v":17.51694915254237},-7.2678331090175021,null,{"$f":"AF108*10","v":15.177966101694915},-19.650067294751,null,{"$f":"AI108*10","v":13.83050847457627},-26.783310901749662,null,{"$f":"AL108*10","v":13.881355932203391},-26.514131897711962,null,{"$f":"AO108*10","v":9.8389830508474567},-47.913862718707939]
[null,null,null,null,null,null,null,null,null,null,null,null,null,"Other",0,null,{"$f":"Q115*10","v":0},0,null,{"$f":"T115*10","v":0},0,null,{"$f":"W115*10","v":0},0,null,{"$f":"Z115*10","v":0},{"$f":"IF(Z179-W179=0,0,(Z179-$O179)/$O179*100)","v":0},null,{"$f":"AC115*10","v":0},0,null,{"$f":"AF115*10","v":0},0,null,{"$f":"AI115*10","v":0},0,null,{"$f":"AL115*10","v":0},0,null,{"$f":"AO115*10","v":0},0]
[]
[null,null,null,null,null,null,null,null,null,null,null,null,null,"Overall",{"$f":"MAX(Q181,W181,Z181,AC181,AF181,AI181,AL181,AO181)","v":56.219797605759226},null,{"$f":"Q23","v":56.219797605759226},{"$f":"IF(Q181-$O181=0,0,(Q181-$O181)/$O181*100)","v":0},null,{"$f":"T23","v":65.373686823409827},{"$f":"IF(T181-$O181=0,0,(T181-$O181)/$O181*100)","v":16.282323322901586},null,{"$f":"W23","v":55.850655887242304},{"$f":"IF(W181-$O181=0,\"NoChange\",(W181-$O181)/$O181*100)","v":-0.65660449563608192},null,{"$f":"Z23","v":49.245824309053603},{"$f":"IF(Z181-$O181=0,\"NoChange\",(Z181-$O181)/$O181*100)","v":-12.404835295940659},null,{"$f":"AC23","v":54.4075706419803},{"$f":"IF(AC181-$O181=0,\"NoChange\",(AC181-$O181)/$O181*100)","v":-3.2234676056416096},null,{"$f":"AF23","v":51.075682919299723},{"$f":"IF(AF181-$O181=0,\"NoChange\",(AF181-$O181)/$O181*100)","v":-9.1500057017859717},null,{"$f":"AI23","v":47.127328444383423},{"$f":"IF(AI181-$O181=0,\"NoChange\",(AI181-$O181)/$O181*100)","v":-16.173073452054474},null,{"$f":"AL23","v":44.535118348107275},{"$f":"IF(AL181-$O181=0,\"NoChange\",(AL181-$O181)/$O181*100)","v":-20.783922666514467},null,{"$f":"AO23","v":34.646003502546634},{"$f":"IF(AO181-$O181=0,\"NoChange\",(AO181-$O181)/$O181*100)","v":-38.374015955195375}]
[]
[null,null,null,null,null,null,null,null,null,null,null,null,null,null,"Lookup col"]
[null,null,null,null,null,null,null,null,null,null,null,null,null,null,{"$f":"3+MATCH(O181,Q181:AP181,0)","v":4}]
[null,null,null,null,null,null,null,null,null,null,null,null,null,1,2,4,5,6,null,5,6,7,8,9,10,11,12,13,14,15,16,17,18,19,20,21,22,23,24,25,26,27]